Build: #1452 failed Scheduled with changes by Niklas Rentz

Stages & jobs

  1. Default Stage

  2. Deploy

Logs

The following logs have been generated by the jobs in this plan.
  • Expand all
  • Collapse all
Job Logs
Collapse Build KWebS Default Stage Download or View
11-Oct-2019 05:21:55 [INFO]
11-Oct-2019 05:21:55 [INFO] parent ............................................. SUCCESS [  0.075 s]
11-Oct-2019 05:21:55 [INFO] KIELER Pragmatics Target Platform .................. SUCCESS [  0.121 s]
11-Oct-2019 05:21:55 [INFO] de.cau.cs.kieler.kwebs.server ...................... SUCCESS [  9.383 s]
11-Oct-2019 05:21:55 [INFO] de.cau.cs.kieler.kwebs.server.feature .............. SUCCESS [  0.332 s]
11-Oct-2019 05:21:55 [INFO] KWEBS Server Product ............................... FAILURE [ 14.802 s]
11-Oct-2019 05:21:55 [INFO] ------------------------------------------------------------------------
11-Oct-2019 05:21:55 [INFO] BUILD FAILURE
11-Oct-2019 05:21:55 [INFO] ------------------------------------------------------------------------
11-Oct-2019 05:21:55 [INFO] Total time: 01:45 min
11-Oct-2019 05:21:55 [INFO] Finished at: 2019-10-11T05:21:55+02:00
11-Oct-2019 05:21:56 [INFO] Final Memory: 148M/1031M
11-Oct-2019 05:21:56 [INFO] ------------------------------------------------------------------------
11-Oct-2019 05:21:56 [ERROR] Failed to execute goal org.eclipse.tycho:tycho-p2-director-plugin:1.2.0:materialize-products (materialize-products) on project de.cau.cs.kieler.kwebs.repository: Installation of product de.cau.cs.kieler.kwebs.server.product for environment linux/gtk/x86 failed: Call to p2 director application failed with exit code 13. Program arguments were: [-metadataRepository, file:/var/atlassian/bamboo/xml-data/build-dir/KIPRAG-KWEBS-JOB1/build/de.cau.cs.kieler.kwebs.repository/target/,file:/var/atlassian/bamboo/xml-data/build-dir/KIPRAG-KWEBS-JOB1/build/de.cau.cs.kieler.kwebs.repository/target/targetPlatformRepository/, -artifactRepository, file:/var/atlassian/bamboo/xml-data/build-dir/KIPRAG-KWEBS-JOB1/build/de.cau.cs.kieler.kwebs.repository/target/,file:/resolution-context-artifacts@%252Fvar%252Fatlassian%252Fbamboo%252Fxml-data%252Fbuild-dir%252FKIPRAG-KWEBS-JOB1%252Fbuild%252Fde.cau.cs.kieler.kwebs.repository,file:/var/atlassian/bamboo/xml-data/build-dir/KIPRAG-KWEBS-JOB1/plugins/de.cau.cs.kieler.kwebs.server/target/,file:/var/atlassian/bamboo/xml-data/build-dir/KIPRAG-KWEBS-JOB1/features/de.cau.cs.kieler.kwebs.server.feature/target/,file:/var/atlassian/bamboo/xml-data/build-dir/KIPRAG-KWEBS-JOB1/build/de.cau.cs.kieler.kwebs.repository/target/,file:/var/atlassian/bamboo/home/.m2/repository/, -installIU, de.cau.cs.kieler.kwebs.server.product, -destination, /var/atlassian/bamboo/xml-data/build-dir/KIPRAG-KWEBS-JOB1/build/de.cau.cs.kieler.kwebs.repository/target/products/de.cau.cs.kieler.kwebs.server.product/linux/gtk/x86/kwebs, -profile, DefaultProfile, -profileProperties, org.eclipse.update.install.features=true, -roaming, -p2.os, linux, -p2.ws, gtk, -p2.arch, x86]. -> [Help 1]
11-Oct-2019 05:21:56 [ERROR]
11-Oct-2019 05:21:56 [ERROR] To see the full stack trace of the errors, re-run Maven with the -e switch.
11-Oct-2019 05:21:56 [ERROR] Re-run Maven using the -X switch to enable full debug logging.
11-Oct-2019 05:21:56 [ERROR]
11-Oct-2019 05:21:56 [ERROR] For more information about the errors and possible solutions, please read the following articles:
11-Oct-2019 05:21:56 [ERROR] [Help 1] http://cwiki.apache.org/confluence/display/MAVEN/MojoFailureException
11-Oct-2019 05:21:56 [ERROR]
11-Oct-2019 05:21:56 [ERROR] After correcting the problems, you can resume the build with the command
11-Oct-2019 05:21:56 [ERROR]   mvn <goals> -rf :de.cau.cs.kieler.kwebs.repository
11-Oct-2019 05:21:57 Unable to publish artifact [KWebS]:
11-Oct-2019 05:21:57 The artifact is required for down stream Stages and Jobs, build will now fail.