Build: #1456 failed Scheduled

Stages & jobs

  1. Default Stage

  2. Deploy

Logs

The following logs have been generated by the jobs in this plan.
  • Expand all
  • Collapse all
Job Logs
Collapse Build KWebS Default Stage Download or View
15-Oct-2019 05:21:53 [INFO]
15-Oct-2019 05:21:53 [INFO] parent ............................................. SUCCESS [  0.061 s]
15-Oct-2019 05:21:53 [INFO] KIELER Pragmatics Target Platform .................. SUCCESS [  0.110 s]
15-Oct-2019 05:21:53 [INFO] de.cau.cs.kieler.kwebs.server ...................... SUCCESS [  9.046 s]
15-Oct-2019 05:21:53 [INFO] de.cau.cs.kieler.kwebs.server.feature .............. SUCCESS [  0.299 s]
15-Oct-2019 05:21:53 [INFO] KWEBS Server Product ............................... FAILURE [ 14.962 s]
15-Oct-2019 05:21:53 [INFO] ------------------------------------------------------------------------
15-Oct-2019 05:21:53 [INFO] BUILD FAILURE
15-Oct-2019 05:21:53 [INFO] ------------------------------------------------------------------------
15-Oct-2019 05:21:53 [INFO] Total time: 01:42 min
15-Oct-2019 05:21:53 [INFO] Finished at: 2019-10-15T05:21:53+02:00
15-Oct-2019 05:21:53 [INFO] Final Memory: 148M/1036M
15-Oct-2019 05:21:53 [INFO] ------------------------------------------------------------------------
15-Oct-2019 05:21:53 [ERROR] Failed to execute goal org.eclipse.tycho:tycho-p2-director-plugin:1.2.0:materialize-products (materialize-products) on project de.cau.cs.kieler.kwebs.repository: Installation of product de.cau.cs.kieler.kwebs.server.product for environment linux/gtk/x86 failed: Call to p2 director application failed with exit code 13. Program arguments were: [-metadataRepository, file:/var/atlassian/bamboo/xml-data/build-dir/KIPRAG-KWEBS-JOB1/build/de.cau.cs.kieler.kwebs.repository/target/,file:/var/atlassian/bamboo/xml-data/build-dir/KIPRAG-KWEBS-JOB1/build/de.cau.cs.kieler.kwebs.repository/target/targetPlatformRepository/, -artifactRepository, file:/var/atlassian/bamboo/xml-data/build-dir/KIPRAG-KWEBS-JOB1/build/de.cau.cs.kieler.kwebs.repository/target/,file:/resolution-context-artifacts@%252Fvar%252Fatlassian%252Fbamboo%252Fxml-data%252Fbuild-dir%252FKIPRAG-KWEBS-JOB1%252Fbuild%252Fde.cau.cs.kieler.kwebs.repository,file:/var/atlassian/bamboo/xml-data/build-dir/KIPRAG-KWEBS-JOB1/plugins/de.cau.cs.kieler.kwebs.server/target/,file:/var/atlassian/bamboo/xml-data/build-dir/KIPRAG-KWEBS-JOB1/features/de.cau.cs.kieler.kwebs.server.feature/target/,file:/var/atlassian/bamboo/xml-data/build-dir/KIPRAG-KWEBS-JOB1/build/de.cau.cs.kieler.kwebs.repository/target/,file:/var/atlassian/bamboo/home/.m2/repository/, -installIU, de.cau.cs.kieler.kwebs.server.product, -destination, /var/atlassian/bamboo/xml-data/build-dir/KIPRAG-KWEBS-JOB1/build/de.cau.cs.kieler.kwebs.repository/target/products/de.cau.cs.kieler.kwebs.server.product/linux/gtk/x86/kwebs, -profile, DefaultProfile, -profileProperties, org.eclipse.update.install.features=true, -roaming, -p2.os, linux, -p2.ws, gtk, -p2.arch, x86]. -> [Help 1]
15-Oct-2019 05:21:53 [ERROR]
15-Oct-2019 05:21:53 [ERROR] To see the full stack trace of the errors, re-run Maven with the -e switch.
15-Oct-2019 05:21:53 [ERROR] Re-run Maven using the -X switch to enable full debug logging.
15-Oct-2019 05:21:53 [ERROR]
15-Oct-2019 05:21:53 [ERROR] For more information about the errors and possible solutions, please read the following articles:
15-Oct-2019 05:21:53 [ERROR] [Help 1] http://cwiki.apache.org/confluence/display/MAVEN/MojoFailureException
15-Oct-2019 05:21:53 [ERROR]
15-Oct-2019 05:21:53 [ERROR] After correcting the problems, you can resume the build with the command
15-Oct-2019 05:21:53 [ERROR]   mvn <goals> -rf :de.cau.cs.kieler.kwebs.repository
15-Oct-2019 05:21:54 Unable to publish artifact [KWebS]:
15-Oct-2019 05:21:54 The artifact is required for down stream Stages and Jobs, build will now fail.