Builds the Klay Layered JavaScript Libraries

Build: #870 failed Scheduled

Stages & jobs

  1. Build

  2. Deploy

Logs

The following logs have been generated by the jobs in this plan.
  • Expand all
  • Collapse all
Job Logs
Collapse Compile and Package Build Download or View
24-Jun-2016 05:04:48 >> file:///var/atlassian/bamboo-data/xml-data/build-dir/KIPRAG-NKLG-JOB1/build/de.cau.cs.kieler.klayjs/test/js/src/test_wrapper.js:117:20
24-Jun-2016 05:04:48 >> forEach@[native code]
24-Jun-2016 05:04:48 >> global code@file:///var/atlassian/bamboo-data/xml-data/build-dir/KIPRAG-NKLG-JOB1/build/de.cau.cs.kieler.klayjs/test/js/src/test_wrapper.js:111:14: The global `expect` is removed in QUnit 2.0.
24-Jun-2016 05:04:48 >> Details in our upgrade guide at https://qunitjs.com/upgrade-guide-2.x/
24-Jun-2016 05:04:48 >> Actual: null
24-Jun-2016 05:04:48 >> Expected: undefined
24-Jun-2016 05:04:48 >> file:///var/atlassian/bamboo-data/xml-data/build-dir/KIPRAG-NKLG-JOB1/build/de.cau.cs.kieler.klayjs/test/js/node_modules/qunitjs/qunit/qunit.js:2144:4
24-Jun-2016 05:04:48
24-Jun-2016 05:04:49 Warning: 8/8 assertions failed (30ms) Use --force to continue.
24-Jun-2016 05:04:49
24-Jun-2016 05:04:49 Aborted due to warnings.
24-Jun-2016 05:04:49 :test/js:testBrowser FAILED
24-Jun-2016 05:04:49
24-Jun-2016 05:04:49 FAILURE: Build failed with an exception.
24-Jun-2016 05:04:49
24-Jun-2016 05:04:49 * What went wrong:
24-Jun-2016 05:04:49 Execution failed for task ':test/js:testBrowser'.
24-Jun-2016 05:04:49 > Process 'command 'node'' finished with non-zero exit value 6
24-Jun-2016 05:04:49
24-Jun-2016 05:04:49 * Try:
24-Jun-2016 05:04:49 Run with --stacktrace option to get the stack trace. Run with --info or --debug option to get more log output.
24-Jun-2016 05:04:49
24-Jun-2016 05:04:49 BUILD FAILED
24-Jun-2016 05:04:49
24-Jun-2016 05:04:49 Total time: 4 mins 41.113 secs