Builds the Klay Layered JavaScript Libraries

Build: #871 failed Scheduled

Stages & jobs

  1. Build

  2. Deploy

Logs

The following logs have been generated by the jobs in this plan.
  • Expand all
  • Collapse all
Job Logs
Collapse Compile and Package Build Download or View
25-Jun-2016 05:05:11 >> file:///var/atlassian/bamboo-data/xml-data/build-dir/KIPRAG-NKLG-JOB1/build/de.cau.cs.kieler.klayjs/test/js/src/test_wrapper.js:117:20
25-Jun-2016 05:05:11 >> forEach@[native code]
25-Jun-2016 05:05:11 >> global code@file:///var/atlassian/bamboo-data/xml-data/build-dir/KIPRAG-NKLG-JOB1/build/de.cau.cs.kieler.klayjs/test/js/src/test_wrapper.js:111:14: The global `expect` is removed in QUnit 2.0.
25-Jun-2016 05:05:11 >> Details in our upgrade guide at https://qunitjs.com/upgrade-guide-2.x/
25-Jun-2016 05:05:11 >> Actual: null
25-Jun-2016 05:05:11 >> Expected: undefined
25-Jun-2016 05:05:11 >> file:///var/atlassian/bamboo-data/xml-data/build-dir/KIPRAG-NKLG-JOB1/build/de.cau.cs.kieler.klayjs/test/js/node_modules/qunitjs/qunit/qunit.js:2144:4
25-Jun-2016 05:05:11
25-Jun-2016 05:05:12 Warning: 8/8 assertions failed (36ms) Use --force to continue.
25-Jun-2016 05:05:12
25-Jun-2016 05:05:12 Aborted due to warnings.
25-Jun-2016 05:05:12 :test/js:testBrowser FAILED
25-Jun-2016 05:05:12
25-Jun-2016 05:05:12 FAILURE: Build failed with an exception.
25-Jun-2016 05:05:12
25-Jun-2016 05:05:12 * What went wrong:
25-Jun-2016 05:05:12 Execution failed for task ':test/js:testBrowser'.
25-Jun-2016 05:05:12 > Process 'command 'node'' finished with non-zero exit value 6
25-Jun-2016 05:05:12
25-Jun-2016 05:05:12 * Try:
25-Jun-2016 05:05:12 Run with --stacktrace option to get the stack trace. Run with --info or --debug option to get more log output.
25-Jun-2016 05:05:12
25-Jun-2016 05:05:12 BUILD FAILED
25-Jun-2016 05:05:12
25-Jun-2016 05:05:12 Total time: 5 mins 3.986 secs