Builds the Klay Layered JavaScript Libraries

Build: #873 failed Scheduled

Stages & jobs

  1. Build

  2. Deploy

Logs

The following logs have been generated by the jobs in this plan.
  • Expand all
  • Collapse all
Job Logs
Collapse Compile and Package Build Download or View
27-Jun-2016 05:04:47 >> file:///var/atlassian/bamboo-data/xml-data/build-dir/KIPRAG-NKLG-JOB1/build/de.cau.cs.kieler.klayjs/test/js/src/test_wrapper.js:117:20
27-Jun-2016 05:04:47 >> forEach@[native code]
27-Jun-2016 05:04:47 >> global code@file:///var/atlassian/bamboo-data/xml-data/build-dir/KIPRAG-NKLG-JOB1/build/de.cau.cs.kieler.klayjs/test/js/src/test_wrapper.js:111:14: The global `expect` is removed in QUnit 2.0.
27-Jun-2016 05:04:47 >> Details in our upgrade guide at https://qunitjs.com/upgrade-guide-2.x/
27-Jun-2016 05:04:47 >> Actual: null
27-Jun-2016 05:04:47 >> Expected: undefined
27-Jun-2016 05:04:47 >> file:///var/atlassian/bamboo-data/xml-data/build-dir/KIPRAG-NKLG-JOB1/build/de.cau.cs.kieler.klayjs/test/js/node_modules/qunitjs/qunit/qunit.js:2144:4
27-Jun-2016 05:04:47
27-Jun-2016 05:04:48 Warning: 8/8 assertions failed (29ms) Use --force to continue.
27-Jun-2016 05:04:48
27-Jun-2016 05:04:48 Aborted due to warnings.
27-Jun-2016 05:04:48 :test/js:testBrowser FAILED
27-Jun-2016 05:04:48
27-Jun-2016 05:04:48 FAILURE: Build failed with an exception.
27-Jun-2016 05:04:48
27-Jun-2016 05:04:48 * What went wrong:
27-Jun-2016 05:04:48 Execution failed for task ':test/js:testBrowser'.
27-Jun-2016 05:04:48 > Process 'command 'node'' finished with non-zero exit value 6
27-Jun-2016 05:04:48
27-Jun-2016 05:04:48 * Try:
27-Jun-2016 05:04:48 Run with --stacktrace option to get the stack trace. Run with --info or --debug option to get more log output.
27-Jun-2016 05:04:48
27-Jun-2016 05:04:48 BUILD FAILED
27-Jun-2016 05:04:48
27-Jun-2016 05:04:48 Total time: 4 mins 39.555 secs