Builds the Klay Layered JavaScript Libraries

Build: #863 failed

Job: Compile and Package failed

Stages & jobs

  1. Build

  2. Deploy

Build log

The build generated 279 lines of output. Download or view full build log.

17-Jun-2016 05:00:01 Build KIELER Pragmatics - Nightly klay.js - Compile and Package #863 (KIPRAG-NKLG-JOB1-863) started building on agent Build Agent 4 - Crazy Capricorn
17-Jun-2016 05:00:01
17-Jun-2016 05:00:01 Build working directory is /var/atlassian/bamboo-data/xml-data/build-dir/KIPRAG-NKLG-JOB1
17-Jun-2016 05:00:01 Executing build KIELER Pragmatics - Nightly klay.js - Compile and Package #863 (KIPRAG-NKLG-JOB1-863)
17-Jun-2016 05:00:01 Starting task 'Checkout Default Repository' of type 'com.atlassian.bamboo.plugins.vcs:task.vcs.checkout'
17-Jun-2016 05:00:01 Build always requires a clean checkout
17-Jun-2016 05:00:01 Cleaning build directory '/var/atlassian/bamboo-data/xml-data/build-dir/KIPRAG-NKLG-JOB1'
17-Jun-2016 05:00:02 Updating source code to revision: b1b04229c40593ee5ec5c6ce77a4532edca87dcd
17-Jun-2016 05:00:04 Fetching 'refs/heads/klayjs' from 'ssh://git@git.rtsys.informatik.uni-kiel.de:7999/KIELER/pragmatics.git'.
17-Jun-2016 05:00:04 Warning: Permanently added '[127.0.0.1]:49945' (RSA) to the list of known hosts.
17-Jun-2016 05:00:05 Checking out revision b1b04229c40593ee5ec5c6ce77a4532edca87dcd.
17-Jun-2016 05:00:05 Creating local git repository in '/var/atlassian/bamboo-data/xml-data/build-dir/KIPRAG-NKLG-JOB1/.git'.
17-Jun-2016 05:00:05 Cloning into '/var/atlassian/bamboo-data/xml-data/build-dir/KIPRAG-NKLG-JOB1'...
17-Jun-2016 05:00:09 Switched to a new branch 'klayjs'
17-Jun-2016 05:00:09 Branch klayjs set up to track remote branch klayjs from origin.
17-Jun-2016 05:00:09 Updated source code to revision: b1b04229c40593ee5ec5c6ce77a4532edca87dcd
17-Jun-2016 05:00:09 Finished task 'Checkout Default Repository' with result: Success
17-Jun-2016 05:00:09 Running pre-build action: VCS Version Collector
17-Jun-2016 05:00:09 Starting task 'gradle' of type 'com.atlassian.bamboo.plugins.scripttask:task.builder.command'
17-Jun-2016 05:00:09
Beginning to execute external process for build 'KIELER Pragmatics - Nightly klay.js - Compile and Package #863 (KIPRAG-NKLG-JOB1-863)'
... running command line:
./gradlew -Dorg.gradle.java.home=/opt/java/jdk64_1.8 -Dorg.gradle.daemon=false -PtestReporter=JUnit clean getGWT all
... in: /var/atlassian/bamboo-data/xml-data/build-dir/KIPRAG-NKLG-JOB1/build/de.cau.cs.kieler.klayjs
... using extra environment variables:
bamboo_planRepository_1_branch=klayjs
bamboo_repository_36044805_previous_revision_number=b1b04229c40593ee5ec5c6ce77a4532edca87dcd
bamboo_capability_system_builder_command_bash=/bin/bash
bamboo_repository_revision_number=b1b04229c40593ee5ec5c6ce77a4532edca87dcd
bamboo_repository_36044805_revision_number=b1b04229c40593ee5ec5c6ce77a4532edca87dcd
bamboo_repository_36044805_git_repositoryUrl=ssh://git@git.rtsys.informatik.uni-kiel.de:7999/KIELER/pragmatics.git
bamboo_repository_36044805_git_branch=klayjs
bamboo_resultsUrl=https://rtsys.informatik.uni-kiel.de/bamboo/browse/KIPRAG-NKLG-JOB1-863
bamboo_repository_36044805_branch_name=klayjs
bamboo_planRepository_1_name=KIELER Pragmatics klayjs branch
bamboo_capability_system_builder_command_Gradle=./gradlew
bamboo_build_working_directory=/var/atlassian/bamboo-data/xml-data/build-dir/KIPRAG-NKLG-JOB1
bamboo_buildKey=KIPRAG-NKLG-JOB1
bamboo_capability_system_builder_command_rsync=/usr/bin/rsync
bamboo_shortPlanName=Nightly klay.js
bamboo_planRepository_name=KIELER Pragmatics klayjs branch
bamboo_capability_system_builder_mvn3_Maven_3_3_3=/opt/maven/maven_3.3.3
bamboo_buildNumber=863
bamboo_shortJobName=Compile and Package
bamboo_buildResultsUrl=https://rtsys.informatik.uni-kiel.de/bamboo/browse/KIPRAG-NKLG-JOB1-863
bamboo_planRepository_repositoryUrl=ssh://git@git.rtsys.informatik.uni-kiel.de:7999/KIELER/pragmatics.git
bamboo_capability_system_builder_command_mmv=/usr/bin/mmv
bamboo_agentId=7208961
bamboo_planName=KIELER Pragmatics - Nightly klay.js
bamboo_repository_36044805_name=KIELER Pragmatics klayjs branch
bamboo_shortPlanKey=NKLG
bamboo_shortJobKey=JOB1
bamboo_planRepository_revision=b1b04229c40593ee5ec5c6ce77a4532edca87dcd
bamboo_repository_previous_revision_number=b1b04229c40593ee5ec5c6ce77a4532edca87dcd
bamboo_buildTimeStamp=2016-06-17T05:00:01.559+02:00
bamboo_planRepository_previousRevision=b1b04229c40593ee5ec5c6ce77a4532edca87dcd
bamboo_buildResultKey=KIPRAG-NKLG-JOB1-863
bamboo_repository_git_branch=klayjs
bamboo_repository_branch_name=klayjs
bamboo_buildPlanName=KIELER Pragmatics - Nightly klay.js - Compile and Package
bamboo_planRepository_1_revision=b1b04229c40593ee5ec5c6ce77a4532edca87dcd
bamboo_repository_name=KIELER Pragmatics klayjs branch
JAVA_HOME=/opt/java/jdk64_1.8
bamboo_planRepository_branch=klayjs
bamboo_agentWorkingDirectory=/var/atlassian/bamboo-data/xml-data/build-dir
bamboo_capability_system_git_executable=/usr/bin/git
bamboo_planRepository_1_previousRevision=b1b04229c40593ee5ec5c6ce77a4532edca87dcd
bamboo_repository_git_username=
bamboo_planRepository_1_type=git
bamboo_planRepository_branchName=klayjs
bamboo_capability_system_jdk_JDK=/opt/java/jdk64
bamboo_repository_36044805_git_username=
bamboo_planRepository_type=git
bamboo_planRepository_1_username=
bamboo_repository_git_repositoryUrl=ssh://git@git.rtsys.informatik.uni-kiel.de:7999/KIELER/pragmatics.git
bamboo_capability_system_builder_ant_Ant=/usr/share/ant
bamboo_capability_system_builder_mvn3_Maven_3=/opt/maven/maven
bamboo_working_directory=/var/atlassian/bamboo-data/xml-data/build-dir/KIPRAG-NKLG-JOB1
bamboo_planKey=KIPRAG-NKLG
bamboo_planRepository_1_repositoryUrl=ssh://git@git.rtsys.informatik.uni-kiel.de:7999/KIELER/pragmatics.git
bamboo_planRepository_username=
bamboo_capability_system_builder_command_scp=/usr/bin/scp
bamboo_capability_system_jdk_JDK_1_8=/opt/java/jdk64_1.8
bamboo_capability_system_builder_command_zip=/usr/bin/zip
bamboo_planRepository_1_branchName=klayjs
17-Jun-2016 05:00:09 Java HotSpot(TM) 64-Bit Server VM warning: ignoring option MaxPermSize=256m; support was removed in 8.0
17-Jun-2016 05:00:10 To honour the JVM settings for this build a new JVM will be forked. Please consider using the daemon: https://docs.gradle.org/2.9/userguide/gradle_daemon.html.
17-Jun-2016 05:00:14 Trying to override old definition of datatype junit
17-Jun-2016 05:00:14 Defining custom 'clean' task when using the standard Gradle lifecycle plugins has been deprecated and is scheduled to be removed in Gradle 3.0
17-Jun-2016 05:00:15 :cleanGetGWT UP-TO-DATE
17-Jun-2016 05:00:15 :clean
17-Jun-2016 05:00:15 :test/java:clean UP-TO-DATE
17-Jun-2016 05:00:15 :test/js:clean UP-TO-DATE
17-Jun-2016 05:00:28 :getGWT
17-Jun-2016 05:00:30 Download https://oss.sonatype.org/content/repositories/snapshots/com/google/guava/guava/20.0-SNAPSHOT/guava-20.0-20160616.171125-223.jar
17-Jun-2016 05:00:34 Download https://oss.sonatype.org/content/repositories/snapshots/com/google/guava/guava-gwt/20.0-SNAPSHOT/guava-gwt-20.0-20160616.171410-222.jar
17-Jun-2016 05:00:36 :buildall
17-Jun-2016 05:00:36 [ant:javac] /var/atlassian/bamboo-data/xml-data/build-dir/KIPRAG-NKLG-JOB1/build/de.cau.cs.kieler.klayjs/build.xml:145: warning: 'includeantruntime' was not set, defaulting to build.sysclasspath=last; set to false for repeatable builds
17-Jun-2016 05:00:41 Note: /var/atlassian/bamboo-data/xml-data/build-dir/KIPRAG-NKLG-JOB1/build/de.cau.cs.kieler.klayjs/src-external/de/cau/cs/kieler/klay/layered/intermediate/BigNodesLabelHandler.java uses unchecked or unsafe operations.
17-Jun-2016 05:00:41 Note: Recompile with -Xlint:unchecked for details.
17-Jun-2016 05:00:41 [ant:javac] /var/atlassian/bamboo-data/xml-data/build-dir/KIPRAG-NKLG-JOB1/build/de.cau.cs.kieler.klayjs/build.xml:148: warning: 'includeantruntime' was not set, defaulting to build.sysclasspath=last; set to false for repeatable builds
17-Jun-2016 05:00:42 Note: /var/atlassian/bamboo-data/xml-data/build-dir/KIPRAG-NKLG-JOB1/build/de.cau.cs.kieler.klayjs/src/de/cau/cs/kieler/klay/gwt/client/layout/RecursiveLGraphLayout.java uses or overrides a deprecated API.
17-Jun-2016 05:00:42 Note: Recompile with -Xlint:deprecation for details.
17-Jun-2016 05:01:55 [ant:javac] /var/atlassian/bamboo-data/xml-data/build-dir/KIPRAG-NKLG-JOB1/build/de.cau.cs.kieler.klayjs/build.xml:145: warning: 'includeantruntime' was not set, defaulting to build.sysclasspath=last; set to false for repeatable builds
17-Jun-2016 05:01:57 Note: /var/atlassian/bamboo-data/xml-data/build-dir/KIPRAG-NKLG-JOB1/build/de.cau.cs.kieler.klayjs/src-external/de/cau/cs/kieler/klay/layered/intermediate/BigNodesLabelHandler.java uses unchecked or unsafe operations.
17-Jun-2016 05:01:57 Note: Recompile with -Xlint:unchecked for details.
17-Jun-2016 05:01:57 [ant:javac] /var/atlassian/bamboo-data/xml-data/build-dir/KIPRAG-NKLG-JOB1/build/de.cau.cs.kieler.klayjs/build.xml:148: warning: 'includeantruntime' was not set, defaulting to build.sysclasspath=last; set to false for repeatable builds
17-Jun-2016 05:01:57 Note: /var/atlassian/bamboo-data/xml-data/build-dir/KIPRAG-NKLG-JOB1/build/de.cau.cs.kieler.klayjs/src/de/cau/cs/kieler/klay/gwt/client/layout/RecursiveLGraphLayout.java uses or overrides a deprecated API.
17-Jun-2016 05:01:57 Note: Recompile with -Xlint:deprecation for details.
17-Jun-2016 05:03:07 [ant:javac] /var/atlassian/bamboo-data/xml-data/build-dir/KIPRAG-NKLG-JOB1/build/de.cau.cs.kieler.klayjs/build.xml:145: warning: 'includeantruntime' was not set, defaulting to build.sysclasspath=last; set to false for repeatable builds
17-Jun-2016 05:03:09 Note: /var/atlassian/bamboo-data/xml-data/build-dir/KIPRAG-NKLG-JOB1/build/de.cau.cs.kieler.klayjs/src-external/de/cau/cs/kieler/klay/layered/intermediate/BigNodesLabelHandler.java uses unchecked or unsafe operations.
17-Jun-2016 05:03:09 [ant:javac] /var/atlassian/bamboo-data/xml-data/build-dir/KIPRAG-NKLG-JOB1/build/de.cau.cs.kieler.klayjs/build.xml:148: warning: 'includeantruntime' was not set, defaulting to build.sysclasspath=last; set to false for repeatable builds
17-Jun-2016 05:03:09 Note: Recompile with -Xlint:unchecked for details.
17-Jun-2016 05:03:09 Note: /var/atlassian/bamboo-data/xml-data/build-dir/KIPRAG-NKLG-JOB1/build/de.cau.cs.kieler.klayjs/src/de/cau/cs/kieler/klay/gwt/client/layout/RecursiveLGraphLayout.java uses or overrides a deprecated API.
17-Jun-2016 05:03:09 Note: Recompile with -Xlint:deprecation for details.
17-Jun-2016 05:03:40 [ant:javac] /var/atlassian/bamboo-data/xml-data/build-dir/KIPRAG-NKLG-JOB1/build/de.cau.cs.kieler.klayjs/build.xml:145: warning: 'includeantruntime' was not set, defaulting to build.sysclasspath=last; set to false for repeatable builds
17-Jun-2016 05:03:42 Note: /var/atlassian/bamboo-data/xml-data/build-dir/KIPRAG-NKLG-JOB1/build/de.cau.cs.kieler.klayjs/src-external/de/cau/cs/kieler/klay/layered/intermediate/BigNodesLabelHandler.java uses unchecked or unsafe operations.
17-Jun-2016 05:03:42 Note: Recompile with -Xlint:unchecked for details.
17-Jun-2016 05:03:42 [ant:javac] /var/atlassian/bamboo-data/xml-data/build-dir/KIPRAG-NKLG-JOB1/build/de.cau.cs.kieler.klayjs/build.xml:148: warning: 'includeantruntime' was not set, defaulting to build.sysclasspath=last; set to false for repeatable builds
17-Jun-2016 05:03:42 Note: /var/atlassian/bamboo-data/xml-data/build-dir/KIPRAG-NKLG-JOB1/build/de.cau.cs.kieler.klayjs/src/de/cau/cs/kieler/klay/gwt/client/layout/RecursiveLGraphLayout.java uses or overrides a deprecated API.
17-Jun-2016 05:03:42 Note: Recompile with -Xlint:deprecation for details.
17-Jun-2016 05:04:13 :copySrc
17-Jun-2016 05:04:13 :javac
17-Jun-2016 05:04:13 [ant:javac] /var/atlassian/bamboo-data/xml-data/build-dir/KIPRAG-NKLG-JOB1/build/de.cau.cs.kieler.klayjs/build.xml:145: warning: 'includeantruntime' was not set, defaulting to build.sysclasspath=last; set to false for repeatable builds
17-Jun-2016 05:04:14 Note: /var/atlassian/bamboo-data/xml-data/build-dir/KIPRAG-NKLG-JOB1/build/de.cau.cs.kieler.klayjs/src-external/de/cau/cs/kieler/klay/layered/intermediate/BigNodesLabelHandler.java uses unchecked or unsafe operations.
17-Jun-2016 05:04:14 Note: Recompile with -Xlint:unchecked for details.
17-Jun-2016 05:04:14 [ant:javac] /var/atlassian/bamboo-data/xml-data/build-dir/KIPRAG-NKLG-JOB1/build/de.cau.cs.kieler.klayjs/build.xml:148: warning: 'includeantruntime' was not set, defaulting to build.sysclasspath=last; set to false for repeatable builds
17-Jun-2016 05:04:14 :test/java:compileJava UP-TO-DATE
17-Jun-2016 05:04:14 :test/java:processResources UP-TO-DATE
17-Jun-2016 05:04:14 :test/java:classes UP-TO-DATE
17-Jun-2016 05:04:15 :test/java:compileTestJava
17-Jun-2016 05:04:15 :test/java:processTestResources UP-TO-DATE
17-Jun-2016 05:04:15 :test/java:testClasses
17-Jun-2016 05:04:16 :test/java:test
17-Jun-2016 05:04:16 :test/js:concatenateTestConfigs
17-Jun-2016 05:04:16 :test/js:nodeSetup SKIPPED
17-Jun-2016 05:04:17 npm WARN package.json klayJStest@0.0.0 No repository field.
17-Jun-2016 05:04:17 npm WARN package.json klayJStest@0.0.0 license should be a valid SPDX license expression
17-Jun-2016 05:04:26 :test/js:installGrunt
17-Jun-2016 05:04:26 grunt-cli@1.2.0 node_modules/grunt-cli
17-Jun-2016 05:04:26 ??? grunt-known-options@1.1.0
17-Jun-2016 05:04:26 ??? nopt@3.0.6 (abbrev@1.0.9)
17-Jun-2016 05:04:26 ??? resolve@1.1.7
17-Jun-2016 05:04:26 ??? findup-sync@0.3.0 (glob@5.0.15)
17-Jun-2016 05:04:26
17-Jun-2016 05:04:26 grunt@1.0.1 node_modules/grunt
17-Jun-2016 05:04:26 ??? path-is-absolute@1.0.0
17-Jun-2016 05:04:26 ??? grunt-known-options@1.1.0
17-Jun-2016 05:04:26 ??? eventemitter2@0.4.14
17-Jun-2016 05:04:26 ??? rimraf@2.2.8
17-Jun-2016 05:04:26 ??? nopt@3.0.6 (abbrev@1.0.9)
17-Jun-2016 05:04:26 ??? exit@0.1.2
17-Jun-2016 05:04:26 ??? minimatch@3.0.0 (brace-expansion@1.1.5)
17-Jun-2016 05:04:26 ??? glob@7.0.4 (inherits@2.0.1, fs.realpath@1.0.0, inflight@1.0.5, once@1.3.3)
17-Jun-2016 05:04:26 ??? findup-sync@0.3.0 (glob@5.0.15)
17-Jun-2016 05:04:26 ??? iconv-lite@0.4.13
17-Jun-2016 05:04:26 ??? coffee-script@1.10.0
17-Jun-2016 05:04:26 ??? dateformat@1.0.12 (get-stdin@4.0.1, meow@3.7.0)
17-Jun-2016 05:04:26 ??? js-yaml@3.5.5 (esprima@2.7.2, argparse@1.0.7)
17-Jun-2016 05:04:26 ??? grunt-legacy-util@1.0.0 (getobject@0.1.0, hooker@0.2.3, which@1.2.10, async@1.5.2, underscore.string@3.2.3, lodash@4.3.0)
17-Jun-2016 05:04:26 ??? grunt-legacy-log@1.0.0 (hooker@0.2.3, colors@1.1.2, underscore.string@3.2.3, lodash@3.10.1, grunt-legacy-log-utils@1.0.0)
17-Jun-2016 05:04:27 :test/js:npmSetup SKIPPED
17-Jun-2016 05:04:27 npm WARN package.json klayJStest@0.0.0 No repository field.
17-Jun-2016 05:04:27 npm WARN package.json klayJStest@0.0.0 license should be a valid SPDX license expression
17-Jun-2016 05:04:32 :test/js:npmInstall
17-Jun-2016 05:04:32
17-Jun-2016 05:04:32 > webworker-threads@0.7.5 install /var/atlassian/bamboo-data/xml-data/build-dir/KIPRAG-NKLG-JOB1/build/de.cau.cs.kieler.klayjs/test/js/node_modules/webworker-threads
17-Jun-2016 05:04:32 > node-gyp rebuild
17-Jun-2016 05:04:32
17-Jun-2016 05:04:33 make: Entering directory `/var/atlassian/bamboo-data/xml-data/build-dir/KIPRAG-NKLG-JOB1/build/de.cau.cs.kieler.klayjs/test/js/node_modules/webworker-threads/build'
17-Jun-2016 05:04:33   CXX(target) Release/obj.target/WebWorkerThreads/src/WebWorkerThreads.o
17-Jun-2016 05:04:36   SOLINK_MODULE(target) Release/obj.target/WebWorkerThreads.node
17-Jun-2016 05:04:36   COPY Release/WebWorkerThreads.node
17-Jun-2016 05:04:36 make: Leaving directory `/var/atlassian/bamboo-data/xml-data/build-dir/KIPRAG-NKLG-JOB1/build/de.cau.cs.kieler.klayjs/test/js/node_modules/webworker-threads/build'
17-Jun-2016 05:04:38
17-Jun-2016 05:04:38 > phantomjs-prebuilt@2.1.7 install /var/atlassian/bamboo-data/xml-data/build-dir/KIPRAG-NKLG-JOB1/build/de.cau.cs.kieler.klayjs/test/js/node_modules/grunt-contrib-qunit/node_modules/grunt-lib-phantomjs/node_modules/phantomjs-prebuilt
17-Jun-2016 05:04:38 > node install.js
17-Jun-2016 05:04:38
17-Jun-2016 05:04:38 PhantomJS not found on PATH
17-Jun-2016 05:04:38 Download already available at /tmp/phantomjs/phantomjs-2.1.1-linux-x86_64.tar.bz2
17-Jun-2016 05:04:39 Verified checksum of previously downloaded file
17-Jun-2016 05:04:39 Extracting tar contents (via spawned process)
17-Jun-2016 05:04:42 Removing /var/atlassian/bamboo-data/xml-data/build-dir/KIPRAG-NKLG-JOB1/build/de.cau.cs.kieler.klayjs/test/js/node_modules/grunt-contrib-qunit/node_modules/grunt-lib-phantomjs/node_modules/phantomjs-prebuilt/lib/phantom
17-Jun-2016 05:04:42 Copying extracted folder /tmp/phantomjs/phantomjs-2.1.1-linux-x86_64.tar.bz2-extract-1466132679115/phantomjs-2.1.1-linux-x86_64 -> /var/atlassian/bamboo-data/xml-data/build-dir/KIPRAG-NKLG-JOB1/build/de.cau.cs.kieler.klayjs/test/js/node_modules/grunt-contrib-qunit/node_modules/grunt-lib-phantomjs/node_modules/phantomjs-prebuilt/lib/phantom
17-Jun-2016 05:04:43 Writing location.js file
17-Jun-2016 05:04:43 Done. Phantomjs binary available at /var/atlassian/bamboo-data/xml-data/build-dir/KIPRAG-NKLG-JOB1/build/de.cau.cs.kieler.klayjs/test/js/node_modules/grunt-contrib-qunit/node_modules/grunt-lib-phantomjs/node_modules/phantomjs-prebuilt/lib/phantom/bin/phantomjs
17-Jun-2016 05:04:44 qunitjs@2.0.0 node_modules/qunitjs
17-Jun-2016 05:04:44
17-Jun-2016 05:04:44 grunt-qunit-junit@0.3.1 node_modules/grunt-qunit-junit
17-Jun-2016 05:04:44 ??? underscore@1.4.4
17-Jun-2016 05:04:44
17-Jun-2016 05:04:44 webworker-threads@0.7.5 node_modules/webworker-threads
17-Jun-2016 05:04:44 ??? bindings@1.2.1
17-Jun-2016 05:04:44 ??? nan@2.3.5
17-Jun-2016 05:04:44
17-Jun-2016 05:04:44 nodeunit@0.9.1 node_modules/nodeunit
17-Jun-2016 05:04:44 ??? tap@0.7.1 (inherits@2.0.1, buffer-equal@0.0.2, slide@1.1.6, deep-equal@1.0.1, yamlish@0.0.7, nopt@3.0.6, mkdirp@0.5.1, difflet@0.2.6, glob@4.5.3, runforcover@0.0.2)
17-Jun-2016 05:04:44
17-Jun-2016 05:04:44 node-gyp@3.3.1 node_modules/node-gyp
17-Jun-2016 05:04:44 ??? graceful-fs@4.1.4
17-Jun-2016 05:04:44 ??? nopt@3.0.6 (abbrev@1.0.9)
17-Jun-2016 05:04:44 ??? osenv@0.1.3 (os-homedir@1.0.1, os-tmpdir@1.0.1)
17-Jun-2016 05:04:44 ??? semver@5.1.0
17-Jun-2016 05:04:44 ??? which@1.2.10 (isexe@1.1.2)
17-Jun-2016 05:04:44 ??? mkdirp@0.5.1 (minimist@0.0.8)
17-Jun-2016 05:04:44 ??? minimatch@1.0.0 (sigmund@1.0.1, lru-cache@2.7.3)
17-Jun-2016 05:04:44 ??? glob@4.5.3 (inherits@2.0.1, inflight@1.0.5, once@1.3.3, minimatch@2.0.10)
17-Jun-2016 05:04:44 ??? tar@2.2.1 (inherits@2.0.1, block-stream@0.0.9)
17-Jun-2016 05:04:44 ??? rimraf@2.5.2 (glob@7.0.4)
17-Jun-2016 05:04:44 ??? npmlog@2.0.4 (ansi@0.3.1, gauge@1.2.7, are-we-there-yet@1.1.2)
17-Jun-2016 05:04:44 ??? fstream@1.0.9 (inherits@2.0.1)
17-Jun-2016 05:04:44 ??? request@2.72.0 (is-typedarray@1.0.0, oauth-sign@0.8.2, aws-sign2@0.6.0, forever-agent@0.6.1, tunnel-agent@0.4.3, caseless@0.11.0, stringstream@0.0.5, isstream@0.1.2, json-stringify-safe@5.0.1, extend@3.0.0, aws4@1.4.1, combined-stream@1.0.5, node-uuid@1.4.7, qs@6.1.0, mime-types@2.1.11, tough-cookie@2.2.2, form-data@1.0.0-rc4, bl@1.1.2, har-validator@2.0.6, http-signature@1.1.1, hawk@3.1.3)
17-Jun-2016 05:04:44 ??? path-array@1.0.1 (array-index@1.0.0)
17-Jun-2016 05:04:44
17-Jun-2016 05:04:44 grunt-contrib-qunit@1.2.0 node_modules/grunt-contrib-qunit
17-Jun-2016 05:04:44 ??? grunt-lib-phantomjs@1.1.0 (eventemitter2@0.4.14, semver@5.1.0, temporary@0.0.8, rimraf@2.5.2, phantomjs-prebuilt@2.1.7)
17-Jun-2016 05:04:45 :plainjslinker
17-Jun-2016 05:04:45 [ant:javac] /var/atlassian/bamboo-data/xml-data/build-dir/KIPRAG-NKLG-JOB1/build/de.cau.cs.kieler.klayjs/build.xml:145: warning: 'includeantruntime' was not set, defaulting to build.sysclasspath=last; set to false for repeatable builds
17-Jun-2016 05:04:47 Note: /var/atlassian/bamboo-data/xml-data/build-dir/KIPRAG-NKLG-JOB1/build/de.cau.cs.kieler.klayjs/src-external/de/cau/cs/kieler/klay/layered/intermediate/BigNodesLabelHandler.java uses unchecked or unsafe operations.
17-Jun-2016 05:04:47 Note: Recompile with -Xlint:unchecked for details.
17-Jun-2016 05:04:47 [ant:javac] /var/atlassian/bamboo-data/xml-data/build-dir/KIPRAG-NKLG-JOB1/build/de.cau.cs.kieler.klayjs/build.xml:148: warning: 'includeantruntime' was not set, defaulting to build.sysclasspath=last; set to false for repeatable builds
17-Jun-2016 05:05:07 :test/js:unzipKlayJs
17-Jun-2016 05:05:08 :test/js:testBrowser
17-Jun-2016 05:05:08 Running "qunit:plainJS" (qunit) task
17-Jun-2016 05:05:09 Testing src/browser/klay_test.html FFFFFFFF
17-Jun-2016 05:05:09 >> [browser]ValidLayoutTest
17-Jun-2016 05:05:09 >> Message: Died on test #1 testInBrowser@file:///var/atlassian/bamboo-data/xml-data/build-dir/KIPRAG-NKLG-JOB1/build/de.cau.cs.kieler.klayjs/test/js/src/test_wrapper.js:5:13
17-Jun-2016 05:05:09 >> file:///var/atlassian/bamboo-data/xml-data/build-dir/KIPRAG-NKLG-JOB1/build/de.cau.cs.kieler.klayjs/test/js/src/test_wrapper.js:117:20
17-Jun-2016 05:05:09 >> forEach@[native code]
17-Jun-2016 05:05:09 >> global code@file:///var/atlassian/bamboo-data/xml-data/build-dir/KIPRAG-NKLG-JOB1/build/de.cau.cs.kieler.klayjs/test/js/src/test_wrapper.js:111:14: The global `expect` is removed in QUnit 2.0.
17-Jun-2016 05:05:09 >> Details in our upgrade guide at https://qunitjs.com/upgrade-guide-2.x/
17-Jun-2016 05:05:09 >> Actual: null
17-Jun-2016 05:05:09 >> Expected: undefined
17-Jun-2016 05:05:09 >> file:///var/atlassian/bamboo-data/xml-data/build-dir/KIPRAG-NKLG-JOB1/build/de.cau.cs.kieler.klayjs/test/js/node_modules/qunitjs/qunit/qunit.js:2144:4
17-Jun-2016 05:05:09
17-Jun-2016 05:05:09 >> [browser]FixedLayoutTest
17-Jun-2016 05:05:09 >> Message: Died on test #1 testInBrowser@file:///var/atlassian/bamboo-data/xml-data/build-dir/KIPRAG-NKLG-JOB1/build/de.cau.cs.kieler.klayjs/test/js/src/test_wrapper.js:5:13
17-Jun-2016 05:05:09 >> file:///var/atlassian/bamboo-data/xml-data/build-dir/KIPRAG-NKLG-JOB1/build/de.cau.cs.kieler.klayjs/test/js/src/test_wrapper.js:117:20
17-Jun-2016 05:05:09 >> forEach@[native code]
17-Jun-2016 05:05:09 >> global code@file:///var/atlassian/bamboo-data/xml-data/build-dir/KIPRAG-NKLG-JOB1/build/de.cau.cs.kieler.klayjs/test/js/src/test_wrapper.js:111:14: The global `expect` is removed in QUnit 2.0.
17-Jun-2016 05:05:09 >> Details in our upgrade guide at https://qunitjs.com/upgrade-guide-2.x/
17-Jun-2016 05:05:09 >> Actual: null
17-Jun-2016 05:05:09 >> Expected: undefined
17-Jun-2016 05:05:09 >> file:///var/atlassian/bamboo-data/xml-data/build-dir/KIPRAG-NKLG-JOB1/build/de.cau.cs.kieler.klayjs/test/js/node_modules/qunitjs/qunit/qunit.js:2144:4
17-Jun-2016 05:05:09
17-Jun-2016 05:05:09 >> [browser]LabelPositionTest
17-Jun-2016 05:05:09 >> Message: Died on test #1 testInBrowser@file:///var/atlassian/bamboo-data/xml-data/build-dir/KIPRAG-NKLG-JOB1/build/de.cau.cs.kieler.klayjs/test/js/src/test_wrapper.js:5:13
17-Jun-2016 05:05:09 >> file:///var/atlassian/bamboo-data/xml-data/build-dir/KIPRAG-NKLG-JOB1/build/de.cau.cs.kieler.klayjs/test/js/src/test_wrapper.js:117:20
17-Jun-2016 05:05:09 >> forEach@[native code]
17-Jun-2016 05:05:09 >> global code@file:///var/atlassian/bamboo-data/xml-data/build-dir/KIPRAG-NKLG-JOB1/build/de.cau.cs.kieler.klayjs/test/js/src/test_wrapper.js:111:14: The global `expect` is removed in QUnit 2.0.
17-Jun-2016 05:05:09 >> Details in our upgrade guide at https://qunitjs.com/upgrade-guide-2.x/
17-Jun-2016 05:05:09 >> Actual: null
17-Jun-2016 05:05:09 >> Expected: undefined
17-Jun-2016 05:05:09 >> file:///var/atlassian/bamboo-data/xml-data/build-dir/KIPRAG-NKLG-JOB1/build/de.cau.cs.kieler.klayjs/test/js/node_modules/qunitjs/qunit/qunit.js:2144:4
17-Jun-2016 05:05:09
17-Jun-2016 05:05:09 >> [browser]SpikeyBeziersTest
17-Jun-2016 05:05:09 >> Message: Died on test #1 testInBrowser@file:///var/atlassian/bamboo-data/xml-data/build-dir/KIPRAG-NKLG-JOB1/build/de.cau.cs.kieler.klayjs/test/js/src/test_wrapper.js:5:13
17-Jun-2016 05:05:09 >> file:///var/atlassian/bamboo-data/xml-data/build-dir/KIPRAG-NKLG-JOB1/build/de.cau.cs.kieler.klayjs/test/js/src/test_wrapper.js:117:20
17-Jun-2016 05:05:09 >> forEach@[native code]
17-Jun-2016 05:05:09 >> global code@file:///var/atlassian/bamboo-data/xml-data/build-dir/KIPRAG-NKLG-JOB1/build/de.cau.cs.kieler.klayjs/test/js/src/test_wrapper.js:111:14: The global `expect` is removed in QUnit 2.0.
17-Jun-2016 05:05:09 >> Details in our upgrade guide at https://qunitjs.com/upgrade-guide-2.x/
17-Jun-2016 05:05:09 >> Actual: null
17-Jun-2016 05:05:09 >> Expected: undefined
17-Jun-2016 05:05:09 >> file:///var/atlassian/bamboo-data/xml-data/build-dir/KIPRAG-NKLG-JOB1/build/de.cau.cs.kieler.klayjs/test/js/node_modules/qunitjs/qunit/qunit.js:2144:4
17-Jun-2016 05:05:09
17-Jun-2016 05:05:09 >> [browser]LabelPositionTest2
17-Jun-2016 05:05:09 >> Message: Died on test #1 testInBrowser@file:///var/atlassian/bamboo-data/xml-data/build-dir/KIPRAG-NKLG-JOB1/build/de.cau.cs.kieler.klayjs/test/js/src/test_wrapper.js:5:13
17-Jun-2016 05:05:09 >> file:///var/atlassian/bamboo-data/xml-data/build-dir/KIPRAG-NKLG-JOB1/build/de.cau.cs.kieler.klayjs/test/js/src/test_wrapper.js:117:20
17-Jun-2016 05:05:09 >> forEach@[native code]
17-Jun-2016 05:05:09 >> global code@file:///var/atlassian/bamboo-data/xml-data/build-dir/KIPRAG-NKLG-JOB1/build/de.cau.cs.kieler.klayjs/test/js/src/test_wrapper.js:111:14: The global `expect` is removed in QUnit 2.0.
17-Jun-2016 05:05:09 >> Details in our upgrade guide at https://qunitjs.com/upgrade-guide-2.x/
17-Jun-2016 05:05:09 >> Actual: null
17-Jun-2016 05:05:09 >> Expected: undefined
17-Jun-2016 05:05:09 >> file:///var/atlassian/bamboo-data/xml-data/build-dir/KIPRAG-NKLG-JOB1/build/de.cau.cs.kieler.klayjs/test/js/node_modules/qunitjs/qunit/qunit.js:2144:4
17-Jun-2016 05:05:09
17-Jun-2016 05:05:09 >> [browser]ChangeAwareArrayList
17-Jun-2016 05:05:09 >> Message: Died on test #1 testInBrowser@file:///var/atlassian/bamboo-data/xml-data/build-dir/KIPRAG-NKLG-JOB1/build/de.cau.cs.kieler.klayjs/test/js/src/test_wrapper.js:5:13
17-Jun-2016 05:05:09 >> file:///var/atlassian/bamboo-data/xml-data/build-dir/KIPRAG-NKLG-JOB1/build/de.cau.cs.kieler.klayjs/test/js/src/test_wrapper.js:117:20
17-Jun-2016 05:05:09 >> forEach@[native code]
17-Jun-2016 05:05:09 >> global code@file:///var/atlassian/bamboo-data/xml-data/build-dir/KIPRAG-NKLG-JOB1/build/de.cau.cs.kieler.klayjs/test/js/src/test_wrapper.js:111:14: The global `expect` is removed in QUnit 2.0.
17-Jun-2016 05:05:09 >> Details in our upgrade guide at https://qunitjs.com/upgrade-guide-2.x/
17-Jun-2016 05:05:09 >> Actual: null
17-Jun-2016 05:05:09 >> Expected: undefined
17-Jun-2016 05:05:09 >> file:///var/atlassian/bamboo-data/xml-data/build-dir/KIPRAG-NKLG-JOB1/build/de.cau.cs.kieler.klayjs/test/js/node_modules/qunitjs/qunit/qunit.js:2144:4
17-Jun-2016 05:05:09
17-Jun-2016 05:05:09 >> [browser]InvalidLayoutTest
17-Jun-2016 05:05:09 >> Message: Died on test #1 testInBrowser@file:///var/atlassian/bamboo-data/xml-data/build-dir/KIPRAG-NKLG-JOB1/build/de.cau.cs.kieler.klayjs/test/js/src/test_wrapper.js:5:13
17-Jun-2016 05:05:09 >> file:///var/atlassian/bamboo-data/xml-data/build-dir/KIPRAG-NKLG-JOB1/build/de.cau.cs.kieler.klayjs/test/js/src/test_wrapper.js:117:20
17-Jun-2016 05:05:09 >> forEach@[native code]
17-Jun-2016 05:05:09 >> global code@file:///var/atlassian/bamboo-data/xml-data/build-dir/KIPRAG-NKLG-JOB1/build/de.cau.cs.kieler.klayjs/test/js/src/test_wrapper.js:111:14: The global `expect` is removed in QUnit 2.0.
17-Jun-2016 05:05:09 >> Details in our upgrade guide at https://qunitjs.com/upgrade-guide-2.x/
17-Jun-2016 05:05:09 >> Actual: null
17-Jun-2016 05:05:09 >> Expected: undefined
17-Jun-2016 05:05:09 >> file:///var/atlassian/bamboo-data/xml-data/build-dir/KIPRAG-NKLG-JOB1/build/de.cau.cs.kieler.klayjs/test/js/node_modules/qunitjs/qunit/qunit.js:2144:4
17-Jun-2016 05:05:09
17-Jun-2016 05:05:09 >> [browser]EdgeSpecificationTest
17-Jun-2016 05:05:09 >> Message: Died on test #1 testInBrowser@file:///var/atlassian/bamboo-data/xml-data/build-dir/KIPRAG-NKLG-JOB1/build/de.cau.cs.kieler.klayjs/test/js/src/test_wrapper.js:5:13
17-Jun-2016 05:05:09 >> file:///var/atlassian/bamboo-data/xml-data/build-dir/KIPRAG-NKLG-JOB1/build/de.cau.cs.kieler.klayjs/test/js/src/test_wrapper.js:117:20
17-Jun-2016 05:05:09 >> forEach@[native code]
17-Jun-2016 05:05:09 >> global code@file:///var/atlassian/bamboo-data/xml-data/build-dir/KIPRAG-NKLG-JOB1/build/de.cau.cs.kieler.klayjs/test/js/src/test_wrapper.js:111:14: The global `expect` is removed in QUnit 2.0.
17-Jun-2016 05:05:09 >> Details in our upgrade guide at https://qunitjs.com/upgrade-guide-2.x/
17-Jun-2016 05:05:09 >> Actual: null
17-Jun-2016 05:05:09 >> Expected: undefined
17-Jun-2016 05:05:09 >> file:///var/atlassian/bamboo-data/xml-data/build-dir/KIPRAG-NKLG-JOB1/build/de.cau.cs.kieler.klayjs/test/js/node_modules/qunitjs/qunit/qunit.js:2144:4
17-Jun-2016 05:05:09
17-Jun-2016 05:05:10 Warning: 8/8 assertions failed (30ms) Use --force to continue.
17-Jun-2016 05:05:10
17-Jun-2016 05:05:10 Aborted due to warnings.
17-Jun-2016 05:05:10 :test/js:testBrowser FAILED
17-Jun-2016 05:05:10
17-Jun-2016 05:05:10 FAILURE: Build failed with an exception.
17-Jun-2016 05:05:10
17-Jun-2016 05:05:10 * What went wrong:
17-Jun-2016 05:05:10 Execution failed for task ':test/js:testBrowser'.
17-Jun-2016 05:05:10 > Process 'command 'node'' finished with non-zero exit value 6
17-Jun-2016 05:05:10
17-Jun-2016 05:05:10 * Try:
17-Jun-2016 05:05:10 Run with --stacktrace option to get the stack trace. Run with --info or --debug option to get more log output.
17-Jun-2016 05:05:10
17-Jun-2016 05:05:10 BUILD FAILED
17-Jun-2016 05:05:10
17-Jun-2016 05:05:10 Total time: 5 mins 0.904 secs
17-Jun-2016 05:05:11 Failing task since return code of [./gradlew -Dorg.gradle.java.home=/opt/java/jdk64_1.8 -Dorg.gradle.daemon=false -PtestReporter=JUnit clean getGWT all] was 1 while expected 0
17-Jun-2016 05:05:11 Finished task 'gradle' with result: Failed
17-Jun-2016 05:05:11 Running post build plugin 'npm Cache Cleanup'
17-Jun-2016 05:05:11 Running post build plugin 'NCover Results Collector'
17-Jun-2016 05:05:11 Running post build plugin 'Clover Results Collector'
17-Jun-2016 05:05:11 Running post build plugin 'Docker Container Cleanup'
17-Jun-2016 05:05:11 Running post build plugin 'Artifact Copier'
17-Jun-2016 05:05:11 Publishing an artifact: KIELER Layout (KLayGWT) Libraries
17-Jun-2016 05:05:11 Finished publishing of artifact Shared artifact: [KIELER Layout (KLayGWT) Libraries], pattern: [*.zip] anchored at: [build/de.cau.cs.kieler.klayjs/target/] in 0s
17-Jun-2016 05:05:11 Finalising the build...
17-Jun-2016 05:05:11 Stopping timer.
17-Jun-2016 05:05:11 Build KIPRAG-NKLG-JOB1-863 completed.
17-Jun-2016 05:05:11 Running on server: post build plugin 'NCover Results Collector'
17-Jun-2016 05:05:11 Running on server: post build plugin 'Clover Delta Calculator'
17-Jun-2016 05:05:11 Running on server: post build plugin 'Maven Dependencies Postprocessor'
17-Jun-2016 05:05:11 Running on server: post build plugin 'Build Hanging Detection Configuration'
17-Jun-2016 05:05:11 All post build plugins have finished
17-Jun-2016 05:05:11 Generating build results summary...
17-Jun-2016 05:05:11 Saving build results to disk...
17-Jun-2016 05:05:11 Logging substituted variables...
17-Jun-2016 05:05:11 Indexing build results...
17-Jun-2016 05:05:11 Finished building KIPRAG-NKLG-JOB1-863.