Builds the Klay Layered JavaScript Libraries

Build: #873 failed

Job: Compile and Package failed

Stages & jobs

  1. Build

  2. Deploy

Build log

The build generated 279 lines of output. Download or view full build log.

27-Jun-2016 05:00:01 Build KIELER Pragmatics - Nightly klay.js - Compile and Package #873 (KIPRAG-NKLG-JOB1-873) started building on agent Build Agent 1 - Rabid Rabbit
27-Jun-2016 05:00:01
27-Jun-2016 05:00:01 Build working directory is /var/atlassian/bamboo-data/xml-data/build-dir/KIPRAG-NKLG-JOB1
27-Jun-2016 05:00:01 Executing build KIELER Pragmatics - Nightly klay.js - Compile and Package #873 (KIPRAG-NKLG-JOB1-873)
27-Jun-2016 05:00:01 Starting task 'Checkout Default Repository' of type 'com.atlassian.bamboo.plugins.vcs:task.vcs.checkout'
27-Jun-2016 05:00:01 Build always requires a clean checkout
27-Jun-2016 05:00:01 Cleaning build directory '/var/atlassian/bamboo-data/xml-data/build-dir/KIPRAG-NKLG-JOB1'
27-Jun-2016 05:00:02 Updating source code to revision: b1b04229c40593ee5ec5c6ce77a4532edca87dcd
27-Jun-2016 05:00:04 Fetching 'refs/heads/klayjs' from 'ssh://git@git.rtsys.informatik.uni-kiel.de:7999/KIELER/pragmatics.git'.
27-Jun-2016 05:00:04 Warning: Permanently added '[127.0.0.1]:49945' (RSA) to the list of known hosts.
27-Jun-2016 05:00:05 Checking out revision b1b04229c40593ee5ec5c6ce77a4532edca87dcd.
27-Jun-2016 05:00:05 Creating local git repository in '/var/atlassian/bamboo-data/xml-data/build-dir/KIPRAG-NKLG-JOB1/.git'.
27-Jun-2016 05:00:05 Cloning into '/var/atlassian/bamboo-data/xml-data/build-dir/KIPRAG-NKLG-JOB1'...
27-Jun-2016 05:00:08 Switched to a new branch 'klayjs'
27-Jun-2016 05:00:08 Branch klayjs set up to track remote branch klayjs from origin.
27-Jun-2016 05:00:08 Updated source code to revision: b1b04229c40593ee5ec5c6ce77a4532edca87dcd
27-Jun-2016 05:00:08 Finished task 'Checkout Default Repository' with result: Success
27-Jun-2016 05:00:08 Running pre-build action: VCS Version Collector
27-Jun-2016 05:00:08 Starting task 'gradle' of type 'com.atlassian.bamboo.plugins.scripttask:task.builder.command'
27-Jun-2016 05:00:08
Beginning to execute external process for build 'KIELER Pragmatics - Nightly klay.js - Compile and Package #873 (KIPRAG-NKLG-JOB1-873)'
... running command line:
./gradlew -Dorg.gradle.java.home=/opt/java/jdk64_1.8 -Dorg.gradle.daemon=false -PtestReporter=JUnit clean getGWT all
... in: /var/atlassian/bamboo-data/xml-data/build-dir/KIPRAG-NKLG-JOB1/build/de.cau.cs.kieler.klayjs
... using extra environment variables:
bamboo_planRepository_1_branch=klayjs
bamboo_repository_36044805_previous_revision_number=b1b04229c40593ee5ec5c6ce77a4532edca87dcd
bamboo_capability_system_builder_command_bash=/bin/bash
bamboo_repository_revision_number=b1b04229c40593ee5ec5c6ce77a4532edca87dcd
bamboo_repository_36044805_revision_number=b1b04229c40593ee5ec5c6ce77a4532edca87dcd
bamboo_repository_36044805_git_repositoryUrl=ssh://git@git.rtsys.informatik.uni-kiel.de:7999/KIELER/pragmatics.git
bamboo_repository_36044805_git_branch=klayjs
bamboo_resultsUrl=https://rtsys.informatik.uni-kiel.de/bamboo/browse/KIPRAG-NKLG-JOB1-873
bamboo_repository_36044805_branch_name=klayjs
bamboo_planRepository_1_name=KIELER Pragmatics klayjs branch
bamboo_capability_system_builder_command_Gradle=./gradlew
bamboo_build_working_directory=/var/atlassian/bamboo-data/xml-data/build-dir/KIPRAG-NKLG-JOB1
bamboo_buildKey=KIPRAG-NKLG-JOB1
bamboo_capability_system_builder_command_rsync=/usr/bin/rsync
bamboo_shortPlanName=Nightly klay.js
bamboo_planRepository_name=KIELER Pragmatics klayjs branch
bamboo_capability_system_builder_mvn3_Maven_3_3_3=/opt/maven/maven_3.3.3
bamboo_buildNumber=873
bamboo_shortJobName=Compile and Package
bamboo_buildResultsUrl=https://rtsys.informatik.uni-kiel.de/bamboo/browse/KIPRAG-NKLG-JOB1-873
bamboo_planRepository_repositoryUrl=ssh://git@git.rtsys.informatik.uni-kiel.de:7999/KIELER/pragmatics.git
bamboo_capability_system_builder_command_mmv=/usr/bin/mmv
bamboo_agentId=7208962
bamboo_planName=KIELER Pragmatics - Nightly klay.js
bamboo_repository_36044805_name=KIELER Pragmatics klayjs branch
bamboo_shortPlanKey=NKLG
bamboo_shortJobKey=JOB1
bamboo_planRepository_revision=b1b04229c40593ee5ec5c6ce77a4532edca87dcd
bamboo_repository_previous_revision_number=b1b04229c40593ee5ec5c6ce77a4532edca87dcd
bamboo_buildTimeStamp=2016-06-27T05:00:01.502+02:00
bamboo_planRepository_previousRevision=b1b04229c40593ee5ec5c6ce77a4532edca87dcd
bamboo_buildResultKey=KIPRAG-NKLG-JOB1-873
bamboo_repository_git_branch=klayjs
bamboo_repository_branch_name=klayjs
bamboo_buildPlanName=KIELER Pragmatics - Nightly klay.js - Compile and Package
bamboo_planRepository_1_revision=b1b04229c40593ee5ec5c6ce77a4532edca87dcd
bamboo_repository_name=KIELER Pragmatics klayjs branch
JAVA_HOME=/opt/java/jdk64_1.8
bamboo_planRepository_branch=klayjs
bamboo_agentWorkingDirectory=/var/atlassian/bamboo-data/xml-data/build-dir
bamboo_capability_system_git_executable=/usr/bin/git
bamboo_planRepository_1_previousRevision=b1b04229c40593ee5ec5c6ce77a4532edca87dcd
bamboo_repository_git_username=
bamboo_planRepository_1_type=git
bamboo_planRepository_branchName=klayjs
bamboo_capability_system_jdk_JDK=/opt/java/jdk64
bamboo_repository_36044805_git_username=
bamboo_planRepository_type=git
bamboo_planRepository_1_username=
bamboo_repository_git_repositoryUrl=ssh://git@git.rtsys.informatik.uni-kiel.de:7999/KIELER/pragmatics.git
bamboo_capability_system_builder_ant_Ant=/usr/share/ant
bamboo_capability_system_builder_mvn3_Maven_3=/opt/maven/maven
bamboo_working_directory=/var/atlassian/bamboo-data/xml-data/build-dir/KIPRAG-NKLG-JOB1
bamboo_planKey=KIPRAG-NKLG
bamboo_planRepository_1_repositoryUrl=ssh://git@git.rtsys.informatik.uni-kiel.de:7999/KIELER/pragmatics.git
bamboo_planRepository_username=
bamboo_capability_system_builder_command_scp=/usr/bin/scp
bamboo_capability_system_jdk_JDK_1_8=/opt/java/jdk64_1.8
bamboo_capability_system_builder_command_zip=/usr/bin/zip
bamboo_planRepository_1_branchName=klayjs
27-Jun-2016 05:00:08 Java HotSpot(TM) 64-Bit Server VM warning: ignoring option MaxPermSize=256m; support was removed in 8.0
27-Jun-2016 05:00:09 To honour the JVM settings for this build a new JVM will be forked. Please consider using the daemon: https://docs.gradle.org/2.9/userguide/gradle_daemon.html.
27-Jun-2016 05:00:13 Trying to override old definition of datatype junit
27-Jun-2016 05:00:13 Defining custom 'clean' task when using the standard Gradle lifecycle plugins has been deprecated and is scheduled to be removed in Gradle 3.0
27-Jun-2016 05:00:15 :cleanGetGWT UP-TO-DATE
27-Jun-2016 05:00:15 :clean
27-Jun-2016 05:00:15 :test/java:clean UP-TO-DATE
27-Jun-2016 05:00:15 :test/js:clean UP-TO-DATE
27-Jun-2016 05:00:17 :getGWT
27-Jun-2016 05:00:17 :buildall
27-Jun-2016 05:00:17 [ant:javac] /var/atlassian/bamboo-data/xml-data/build-dir/KIPRAG-NKLG-JOB1/build/de.cau.cs.kieler.klayjs/build.xml:145: warning: 'includeantruntime' was not set, defaulting to build.sysclasspath=last; set to false for repeatable builds
27-Jun-2016 05:00:22 Note: /var/atlassian/bamboo-data/xml-data/build-dir/KIPRAG-NKLG-JOB1/build/de.cau.cs.kieler.klayjs/src-external/de/cau/cs/kieler/klay/layered/intermediate/BigNodesLabelHandler.java uses unchecked or unsafe operations.
27-Jun-2016 05:00:22 Note: Recompile with -Xlint:unchecked for details.
27-Jun-2016 05:00:22 [ant:javac] /var/atlassian/bamboo-data/xml-data/build-dir/KIPRAG-NKLG-JOB1/build/de.cau.cs.kieler.klayjs/build.xml:148: warning: 'includeantruntime' was not set, defaulting to build.sysclasspath=last; set to false for repeatable builds
27-Jun-2016 05:00:22 Note: /var/atlassian/bamboo-data/xml-data/build-dir/KIPRAG-NKLG-JOB1/build/de.cau.cs.kieler.klayjs/src/de/cau/cs/kieler/klay/gwt/client/layout/RecursiveLGraphLayout.java uses or overrides a deprecated API.
27-Jun-2016 05:00:22 Note: Recompile with -Xlint:deprecation for details.
27-Jun-2016 05:01:36 [ant:javac] /var/atlassian/bamboo-data/xml-data/build-dir/KIPRAG-NKLG-JOB1/build/de.cau.cs.kieler.klayjs/build.xml:145: warning: 'includeantruntime' was not set, defaulting to build.sysclasspath=last; set to false for repeatable builds
27-Jun-2016 05:01:37 Note: /var/atlassian/bamboo-data/xml-data/build-dir/KIPRAG-NKLG-JOB1/build/de.cau.cs.kieler.klayjs/src-external/de/cau/cs/kieler/klay/layered/intermediate/BigNodesLabelHandler.java uses unchecked or unsafe operations.
27-Jun-2016 05:01:37 Note: Recompile with -Xlint:unchecked for details.
27-Jun-2016 05:01:37 [ant:javac] /var/atlassian/bamboo-data/xml-data/build-dir/KIPRAG-NKLG-JOB1/build/de.cau.cs.kieler.klayjs/build.xml:148: warning: 'includeantruntime' was not set, defaulting to build.sysclasspath=last; set to false for repeatable builds
27-Jun-2016 05:01:38 Note: /var/atlassian/bamboo-data/xml-data/build-dir/KIPRAG-NKLG-JOB1/build/de.cau.cs.kieler.klayjs/src/de/cau/cs/kieler/klay/gwt/client/layout/RecursiveLGraphLayout.java uses or overrides a deprecated API.
27-Jun-2016 05:01:38 Note: Recompile with -Xlint:deprecation for details.
27-Jun-2016 05:02:48 [ant:javac] /var/atlassian/bamboo-data/xml-data/build-dir/KIPRAG-NKLG-JOB1/build/de.cau.cs.kieler.klayjs/build.xml:145: warning: 'includeantruntime' was not set, defaulting to build.sysclasspath=last; set to false for repeatable builds
27-Jun-2016 05:02:49 Note: /var/atlassian/bamboo-data/xml-data/build-dir/KIPRAG-NKLG-JOB1/build/de.cau.cs.kieler.klayjs/src-external/de/cau/cs/kieler/klay/layered/intermediate/BigNodesLabelHandler.java uses unchecked or unsafe operations.
27-Jun-2016 05:02:49 [ant:javac] /var/atlassian/bamboo-data/xml-data/build-dir/KIPRAG-NKLG-JOB1/build/de.cau.cs.kieler.klayjs/build.xml:148: warning: 'includeantruntime' was not set, defaulting to build.sysclasspath=last; set to false for repeatable builds
27-Jun-2016 05:02:49 Note: Recompile with -Xlint:unchecked for details.
27-Jun-2016 05:02:49 Note: /var/atlassian/bamboo-data/xml-data/build-dir/KIPRAG-NKLG-JOB1/build/de.cau.cs.kieler.klayjs/src/de/cau/cs/kieler/klay/gwt/client/layout/RecursiveLGraphLayout.java uses or overrides a deprecated API.
27-Jun-2016 05:02:49 Note: Recompile with -Xlint:deprecation for details.
27-Jun-2016 05:03:20 [ant:javac] /var/atlassian/bamboo-data/xml-data/build-dir/KIPRAG-NKLG-JOB1/build/de.cau.cs.kieler.klayjs/build.xml:145: warning: 'includeantruntime' was not set, defaulting to build.sysclasspath=last; set to false for repeatable builds
27-Jun-2016 05:03:22 Note: /var/atlassian/bamboo-data/xml-data/build-dir/KIPRAG-NKLG-JOB1/build/de.cau.cs.kieler.klayjs/src-external/de/cau/cs/kieler/klay/layered/intermediate/BigNodesLabelHandler.java uses unchecked or unsafe operations.
27-Jun-2016 05:03:22 Note: Recompile with -Xlint:unchecked for details.
27-Jun-2016 05:03:22 [ant:javac] /var/atlassian/bamboo-data/xml-data/build-dir/KIPRAG-NKLG-JOB1/build/de.cau.cs.kieler.klayjs/build.xml:148: warning: 'includeantruntime' was not set, defaulting to build.sysclasspath=last; set to false for repeatable builds
27-Jun-2016 05:03:22 Note: /var/atlassian/bamboo-data/xml-data/build-dir/KIPRAG-NKLG-JOB1/build/de.cau.cs.kieler.klayjs/src/de/cau/cs/kieler/klay/gwt/client/layout/RecursiveLGraphLayout.java uses or overrides a deprecated API.
27-Jun-2016 05:03:22 Note: Recompile with -Xlint:deprecation for details.
27-Jun-2016 05:03:53 :copySrc
27-Jun-2016 05:03:53 :javac
27-Jun-2016 05:03:53 [ant:javac] /var/atlassian/bamboo-data/xml-data/build-dir/KIPRAG-NKLG-JOB1/build/de.cau.cs.kieler.klayjs/build.xml:145: warning: 'includeantruntime' was not set, defaulting to build.sysclasspath=last; set to false for repeatable builds
27-Jun-2016 05:03:55 Note: /var/atlassian/bamboo-data/xml-data/build-dir/KIPRAG-NKLG-JOB1/build/de.cau.cs.kieler.klayjs/src-external/de/cau/cs/kieler/klay/layered/intermediate/BigNodesLabelHandler.java uses unchecked or unsafe operations.
27-Jun-2016 05:03:55 Note: Recompile with -Xlint:unchecked for details.
27-Jun-2016 05:03:55 [ant:javac] /var/atlassian/bamboo-data/xml-data/build-dir/KIPRAG-NKLG-JOB1/build/de.cau.cs.kieler.klayjs/build.xml:148: warning: 'includeantruntime' was not set, defaulting to build.sysclasspath=last; set to false for repeatable builds
27-Jun-2016 05:03:55 :test/java:compileJava UP-TO-DATE
27-Jun-2016 05:03:55 :test/java:processResources UP-TO-DATE
27-Jun-2016 05:03:55 :test/java:classes UP-TO-DATE
27-Jun-2016 05:03:55 :test/java:compileTestJava
27-Jun-2016 05:03:55 :test/java:processTestResources UP-TO-DATE
27-Jun-2016 05:03:55 :test/java:testClasses
27-Jun-2016 05:03:56 :test/java:test
27-Jun-2016 05:03:56 :test/js:concatenateTestConfigs
27-Jun-2016 05:03:56 :test/js:nodeSetup SKIPPED
27-Jun-2016 05:03:57 npm WARN package.json klayJStest@0.0.0 No repository field.
27-Jun-2016 05:03:57 npm WARN package.json klayJStest@0.0.0 license should be a valid SPDX license expression
27-Jun-2016 05:04:05 :test/js:installGrunt
27-Jun-2016 05:04:05 grunt-cli@1.2.0 node_modules/grunt-cli
27-Jun-2016 05:04:05 ??? grunt-known-options@1.1.0
27-Jun-2016 05:04:05 ??? nopt@3.0.6 (abbrev@1.0.9)
27-Jun-2016 05:04:05 ??? resolve@1.1.7
27-Jun-2016 05:04:05 ??? findup-sync@0.3.0 (glob@5.0.15)
27-Jun-2016 05:04:05
27-Jun-2016 05:04:05 grunt@1.0.1 node_modules/grunt
27-Jun-2016 05:04:05 ??? path-is-absolute@1.0.0
27-Jun-2016 05:04:05 ??? grunt-known-options@1.1.0
27-Jun-2016 05:04:05 ??? eventemitter2@0.4.14
27-Jun-2016 05:04:05 ??? rimraf@2.2.8
27-Jun-2016 05:04:05 ??? exit@0.1.2
27-Jun-2016 05:04:05 ??? nopt@3.0.6 (abbrev@1.0.9)
27-Jun-2016 05:04:05 ??? glob@7.0.5 (inherits@2.0.1, fs.realpath@1.0.0, once@1.3.3, inflight@1.0.5)
27-Jun-2016 05:04:05 ??? minimatch@3.0.2 (brace-expansion@1.1.5)
27-Jun-2016 05:04:05 ??? findup-sync@0.3.0 (glob@5.0.15)
27-Jun-2016 05:04:05 ??? iconv-lite@0.4.13
27-Jun-2016 05:04:05 ??? coffee-script@1.10.0
27-Jun-2016 05:04:05 ??? dateformat@1.0.12 (get-stdin@4.0.1, meow@3.7.0)
27-Jun-2016 05:04:05 ??? js-yaml@3.5.5 (esprima@2.7.2, argparse@1.0.7)
27-Jun-2016 05:04:05 ??? grunt-legacy-util@1.0.0 (getobject@0.1.0, hooker@0.2.3, which@1.2.10, async@1.5.2, underscore.string@3.2.3, lodash@4.3.0)
27-Jun-2016 05:04:05 ??? grunt-legacy-log@1.0.0 (hooker@0.2.3, colors@1.1.2, underscore.string@3.2.3, lodash@3.10.1, grunt-legacy-log-utils@1.0.0)
27-Jun-2016 05:04:05 :test/js:npmSetup SKIPPED
27-Jun-2016 05:04:06 npm WARN package.json klayJStest@0.0.0 No repository field.
27-Jun-2016 05:04:06 npm WARN package.json klayJStest@0.0.0 license should be a valid SPDX license expression
27-Jun-2016 05:04:11 :test/js:npmInstall
27-Jun-2016 05:04:11
27-Jun-2016 05:04:11 > webworker-threads@0.7.5 install /var/atlassian/bamboo-data/xml-data/build-dir/KIPRAG-NKLG-JOB1/build/de.cau.cs.kieler.klayjs/test/js/node_modules/webworker-threads
27-Jun-2016 05:04:11 > node-gyp rebuild
27-Jun-2016 05:04:11
27-Jun-2016 05:04:12 make: Entering directory `/var/atlassian/bamboo-data/xml-data/build-dir/KIPRAG-NKLG-JOB1/build/de.cau.cs.kieler.klayjs/test/js/node_modules/webworker-threads/build'
27-Jun-2016 05:04:12   CXX(target) Release/obj.target/WebWorkerThreads/src/WebWorkerThreads.o
27-Jun-2016 05:04:14   SOLINK_MODULE(target) Release/obj.target/WebWorkerThreads.node
27-Jun-2016 05:04:14   COPY Release/WebWorkerThreads.node
27-Jun-2016 05:04:14 make: Leaving directory `/var/atlassian/bamboo-data/xml-data/build-dir/KIPRAG-NKLG-JOB1/build/de.cau.cs.kieler.klayjs/test/js/node_modules/webworker-threads/build'
27-Jun-2016 05:04:14 npm WARN deprecated minimatch@2.0.10: Please update to minimatch 3.0.2 or higher to avoid a RegExp DoS issue
27-Jun-2016 05:04:14 npm WARN deprecated minimatch@1.0.0: Please update to minimatch 3.0.2 or higher to avoid a RegExp DoS issue
27-Jun-2016 05:04:14
27-Jun-2016 05:04:14 > phantomjs-prebuilt@2.1.7 install /var/atlassian/bamboo-data/xml-data/build-dir/KIPRAG-NKLG-JOB1/build/de.cau.cs.kieler.klayjs/test/js/node_modules/grunt-contrib-qunit/node_modules/grunt-lib-phantomjs/node_modules/phantomjs-prebuilt
27-Jun-2016 05:04:14 > node install.js
27-Jun-2016 05:04:14
27-Jun-2016 05:04:15 PhantomJS not found on PATH
27-Jun-2016 05:04:15 Download already available at /tmp/phantomjs/phantomjs-2.1.1-linux-x86_64.tar.bz2
27-Jun-2016 05:04:15 Verified checksum of previously downloaded file
27-Jun-2016 05:04:15 Extracting tar contents (via spawned process)
27-Jun-2016 05:04:19 Removing /var/atlassian/bamboo-data/xml-data/build-dir/KIPRAG-NKLG-JOB1/build/de.cau.cs.kieler.klayjs/test/js/node_modules/grunt-contrib-qunit/node_modules/grunt-lib-phantomjs/node_modules/phantomjs-prebuilt/lib/phantom
27-Jun-2016 05:04:19 Copying extracted folder /tmp/phantomjs/phantomjs-2.1.1-linux-x86_64.tar.bz2-extract-1466996655753/phantomjs-2.1.1-linux-x86_64 -> /var/atlassian/bamboo-data/xml-data/build-dir/KIPRAG-NKLG-JOB1/build/de.cau.cs.kieler.klayjs/test/js/node_modules/grunt-contrib-qunit/node_modules/grunt-lib-phantomjs/node_modules/phantomjs-prebuilt/lib/phantom
27-Jun-2016 05:04:20 Writing location.js file
27-Jun-2016 05:04:20 Done. Phantomjs binary available at /var/atlassian/bamboo-data/xml-data/build-dir/KIPRAG-NKLG-JOB1/build/de.cau.cs.kieler.klayjs/test/js/node_modules/grunt-contrib-qunit/node_modules/grunt-lib-phantomjs/node_modules/phantomjs-prebuilt/lib/phantom/bin/phantomjs
27-Jun-2016 05:04:21 qunitjs@2.0.0 node_modules/qunitjs
27-Jun-2016 05:04:21
27-Jun-2016 05:04:21 grunt-qunit-junit@0.3.1 node_modules/grunt-qunit-junit
27-Jun-2016 05:04:21 ??? underscore@1.4.4
27-Jun-2016 05:04:21
27-Jun-2016 05:04:21 webworker-threads@0.7.5 node_modules/webworker-threads
27-Jun-2016 05:04:21 ??? bindings@1.2.1
27-Jun-2016 05:04:21 ??? nan@2.3.5
27-Jun-2016 05:04:21
27-Jun-2016 05:04:21 nodeunit@0.9.1 node_modules/nodeunit
27-Jun-2016 05:04:21 ??? tap@0.7.1 (inherits@2.0.1, buffer-equal@0.0.2, slide@1.1.6, deep-equal@1.0.1, yamlish@0.0.7, nopt@3.0.6, mkdirp@0.5.1, glob@4.5.3, difflet@0.2.6, runforcover@0.0.2)
27-Jun-2016 05:04:21
27-Jun-2016 05:04:21 grunt-contrib-qunit@1.2.0 node_modules/grunt-contrib-qunit
27-Jun-2016 05:04:21 ??? grunt-lib-phantomjs@1.1.0 (eventemitter2@0.4.14, semver@5.1.1, temporary@0.0.8, rimraf@2.5.2, phantomjs-prebuilt@2.1.7)
27-Jun-2016 05:04:21
27-Jun-2016 05:04:21 node-gyp@3.3.1 node_modules/node-gyp
27-Jun-2016 05:04:21 ??? graceful-fs@4.1.4
27-Jun-2016 05:04:21 ??? osenv@0.1.3 (os-tmpdir@1.0.1, os-homedir@1.0.1)
27-Jun-2016 05:04:21 ??? nopt@3.0.6 (abbrev@1.0.9)
27-Jun-2016 05:04:21 ??? semver@5.1.1
27-Jun-2016 05:04:21 ??? which@1.2.10 (isexe@1.1.2)
27-Jun-2016 05:04:21 ??? fstream@1.0.10 (inherits@2.0.1)
27-Jun-2016 05:04:21 ??? mkdirp@0.5.1 (minimist@0.0.8)
27-Jun-2016 05:04:21 ??? minimatch@1.0.0 (sigmund@1.0.1, lru-cache@2.7.3)
27-Jun-2016 05:04:21 ??? glob@4.5.3 (inherits@2.0.1, inflight@1.0.5, once@1.3.3, minimatch@2.0.10)
27-Jun-2016 05:04:21 ??? tar@2.2.1 (inherits@2.0.1, block-stream@0.0.9)
27-Jun-2016 05:04:21 ??? rimraf@2.5.2 (glob@7.0.5)
27-Jun-2016 05:04:21 ??? npmlog@2.0.4 (ansi@0.3.1, gauge@1.2.7, are-we-there-yet@1.1.2)
27-Jun-2016 05:04:21 ??? request@2.72.0 (is-typedarray@1.0.0, oauth-sign@0.8.2, aws-sign2@0.6.0, forever-agent@0.6.1, tunnel-agent@0.4.3, caseless@0.11.0, stringstream@0.0.5, isstream@0.1.2, json-stringify-safe@5.0.1, extend@3.0.0, aws4@1.4.1, combined-stream@1.0.5, node-uuid@1.4.7, qs@6.1.0, mime-types@2.1.11, tough-cookie@2.2.2, form-data@1.0.0-rc4, bl@1.1.2, http-signature@1.1.1, hawk@3.1.3, har-validator@2.0.6)
27-Jun-2016 05:04:21 ??? path-array@1.0.1 (array-index@1.0.0)
27-Jun-2016 05:04:22 :plainjslinker
27-Jun-2016 05:04:22 [ant:javac] /var/atlassian/bamboo-data/xml-data/build-dir/KIPRAG-NKLG-JOB1/build/de.cau.cs.kieler.klayjs/build.xml:145: warning: 'includeantruntime' was not set, defaulting to build.sysclasspath=last; set to false for repeatable builds
27-Jun-2016 05:04:25 Note: /var/atlassian/bamboo-data/xml-data/build-dir/KIPRAG-NKLG-JOB1/build/de.cau.cs.kieler.klayjs/src-external/de/cau/cs/kieler/klay/layered/intermediate/BigNodesLabelHandler.java uses unchecked or unsafe operations.
27-Jun-2016 05:04:25 Note: Recompile with -Xlint:unchecked for details.
27-Jun-2016 05:04:25 [ant:javac] /var/atlassian/bamboo-data/xml-data/build-dir/KIPRAG-NKLG-JOB1/build/de.cau.cs.kieler.klayjs/build.xml:148: warning: 'includeantruntime' was not set, defaulting to build.sysclasspath=last; set to false for repeatable builds
27-Jun-2016 05:04:45 :test/js:unzipKlayJs
27-Jun-2016 05:04:46 :test/js:testBrowser
27-Jun-2016 05:04:46 Running "qunit:plainJS" (qunit) task
27-Jun-2016 05:04:47 Testing src/browser/klay_test.html FFFFFFFF
27-Jun-2016 05:04:47 >> [browser]ValidLayoutTest
27-Jun-2016 05:04:47 >> Message: Died on test #1 testInBrowser@file:///var/atlassian/bamboo-data/xml-data/build-dir/KIPRAG-NKLG-JOB1/build/de.cau.cs.kieler.klayjs/test/js/src/test_wrapper.js:5:13
27-Jun-2016 05:04:47 >> file:///var/atlassian/bamboo-data/xml-data/build-dir/KIPRAG-NKLG-JOB1/build/de.cau.cs.kieler.klayjs/test/js/src/test_wrapper.js:117:20
27-Jun-2016 05:04:47 >> forEach@[native code]
27-Jun-2016 05:04:47 >> global code@file:///var/atlassian/bamboo-data/xml-data/build-dir/KIPRAG-NKLG-JOB1/build/de.cau.cs.kieler.klayjs/test/js/src/test_wrapper.js:111:14: The global `expect` is removed in QUnit 2.0.
27-Jun-2016 05:04:47 >> Details in our upgrade guide at https://qunitjs.com/upgrade-guide-2.x/
27-Jun-2016 05:04:47 >> Actual: null
27-Jun-2016 05:04:47 >> Expected: undefined
27-Jun-2016 05:04:47 >> file:///var/atlassian/bamboo-data/xml-data/build-dir/KIPRAG-NKLG-JOB1/build/de.cau.cs.kieler.klayjs/test/js/node_modules/qunitjs/qunit/qunit.js:2144:4
27-Jun-2016 05:04:47
27-Jun-2016 05:04:47 >> [browser]FixedLayoutTest
27-Jun-2016 05:04:47 >> Message: Died on test #1 testInBrowser@file:///var/atlassian/bamboo-data/xml-data/build-dir/KIPRAG-NKLG-JOB1/build/de.cau.cs.kieler.klayjs/test/js/src/test_wrapper.js:5:13
27-Jun-2016 05:04:47 >> file:///var/atlassian/bamboo-data/xml-data/build-dir/KIPRAG-NKLG-JOB1/build/de.cau.cs.kieler.klayjs/test/js/src/test_wrapper.js:117:20
27-Jun-2016 05:04:47 >> forEach@[native code]
27-Jun-2016 05:04:47 >> global code@file:///var/atlassian/bamboo-data/xml-data/build-dir/KIPRAG-NKLG-JOB1/build/de.cau.cs.kieler.klayjs/test/js/src/test_wrapper.js:111:14: The global `expect` is removed in QUnit 2.0.
27-Jun-2016 05:04:47 >> Details in our upgrade guide at https://qunitjs.com/upgrade-guide-2.x/
27-Jun-2016 05:04:47 >> Actual: null
27-Jun-2016 05:04:47 >> Expected: undefined
27-Jun-2016 05:04:47 >> file:///var/atlassian/bamboo-data/xml-data/build-dir/KIPRAG-NKLG-JOB1/build/de.cau.cs.kieler.klayjs/test/js/node_modules/qunitjs/qunit/qunit.js:2144:4
27-Jun-2016 05:04:47
27-Jun-2016 05:04:47 >> [browser]LabelPositionTest
27-Jun-2016 05:04:47 >> Message: Died on test #1 testInBrowser@file:///var/atlassian/bamboo-data/xml-data/build-dir/KIPRAG-NKLG-JOB1/build/de.cau.cs.kieler.klayjs/test/js/src/test_wrapper.js:5:13
27-Jun-2016 05:04:47 >> file:///var/atlassian/bamboo-data/xml-data/build-dir/KIPRAG-NKLG-JOB1/build/de.cau.cs.kieler.klayjs/test/js/src/test_wrapper.js:117:20
27-Jun-2016 05:04:47 >> forEach@[native code]
27-Jun-2016 05:04:47 >> global code@file:///var/atlassian/bamboo-data/xml-data/build-dir/KIPRAG-NKLG-JOB1/build/de.cau.cs.kieler.klayjs/test/js/src/test_wrapper.js:111:14: The global `expect` is removed in QUnit 2.0.
27-Jun-2016 05:04:47 >> Details in our upgrade guide at https://qunitjs.com/upgrade-guide-2.x/
27-Jun-2016 05:04:47 >> Actual: null
27-Jun-2016 05:04:47 >> Expected: undefined
27-Jun-2016 05:04:47 >> file:///var/atlassian/bamboo-data/xml-data/build-dir/KIPRAG-NKLG-JOB1/build/de.cau.cs.kieler.klayjs/test/js/node_modules/qunitjs/qunit/qunit.js:2144:4
27-Jun-2016 05:04:47
27-Jun-2016 05:04:47 >> [browser]SpikeyBeziersTest
27-Jun-2016 05:04:47 >> Message: Died on test #1 testInBrowser@file:///var/atlassian/bamboo-data/xml-data/build-dir/KIPRAG-NKLG-JOB1/build/de.cau.cs.kieler.klayjs/test/js/src/test_wrapper.js:5:13
27-Jun-2016 05:04:47 >> file:///var/atlassian/bamboo-data/xml-data/build-dir/KIPRAG-NKLG-JOB1/build/de.cau.cs.kieler.klayjs/test/js/src/test_wrapper.js:117:20
27-Jun-2016 05:04:47 >> forEach@[native code]
27-Jun-2016 05:04:47 >> global code@file:///var/atlassian/bamboo-data/xml-data/build-dir/KIPRAG-NKLG-JOB1/build/de.cau.cs.kieler.klayjs/test/js/src/test_wrapper.js:111:14: The global `expect` is removed in QUnit 2.0.
27-Jun-2016 05:04:47 >> Details in our upgrade guide at https://qunitjs.com/upgrade-guide-2.x/
27-Jun-2016 05:04:47 >> Actual: null
27-Jun-2016 05:04:47 >> Expected: undefined
27-Jun-2016 05:04:47 >> file:///var/atlassian/bamboo-data/xml-data/build-dir/KIPRAG-NKLG-JOB1/build/de.cau.cs.kieler.klayjs/test/js/node_modules/qunitjs/qunit/qunit.js:2144:4
27-Jun-2016 05:04:47
27-Jun-2016 05:04:47 >> [browser]LabelPositionTest2
27-Jun-2016 05:04:47 >> Message: Died on test #1 testInBrowser@file:///var/atlassian/bamboo-data/xml-data/build-dir/KIPRAG-NKLG-JOB1/build/de.cau.cs.kieler.klayjs/test/js/src/test_wrapper.js:5:13
27-Jun-2016 05:04:47 >> file:///var/atlassian/bamboo-data/xml-data/build-dir/KIPRAG-NKLG-JOB1/build/de.cau.cs.kieler.klayjs/test/js/src/test_wrapper.js:117:20
27-Jun-2016 05:04:47 >> forEach@[native code]
27-Jun-2016 05:04:47 >> global code@file:///var/atlassian/bamboo-data/xml-data/build-dir/KIPRAG-NKLG-JOB1/build/de.cau.cs.kieler.klayjs/test/js/src/test_wrapper.js:111:14: The global `expect` is removed in QUnit 2.0.
27-Jun-2016 05:04:47 >> Details in our upgrade guide at https://qunitjs.com/upgrade-guide-2.x/
27-Jun-2016 05:04:47 >> Actual: null
27-Jun-2016 05:04:47 >> Expected: undefined
27-Jun-2016 05:04:47 >> file:///var/atlassian/bamboo-data/xml-data/build-dir/KIPRAG-NKLG-JOB1/build/de.cau.cs.kieler.klayjs/test/js/node_modules/qunitjs/qunit/qunit.js:2144:4
27-Jun-2016 05:04:47
27-Jun-2016 05:04:47 >> [browser]ChangeAwareArrayList
27-Jun-2016 05:04:47 >> Message: Died on test #1 testInBrowser@file:///var/atlassian/bamboo-data/xml-data/build-dir/KIPRAG-NKLG-JOB1/build/de.cau.cs.kieler.klayjs/test/js/src/test_wrapper.js:5:13
27-Jun-2016 05:04:47 >> file:///var/atlassian/bamboo-data/xml-data/build-dir/KIPRAG-NKLG-JOB1/build/de.cau.cs.kieler.klayjs/test/js/src/test_wrapper.js:117:20
27-Jun-2016 05:04:47 >> forEach@[native code]
27-Jun-2016 05:04:47 >> global code@file:///var/atlassian/bamboo-data/xml-data/build-dir/KIPRAG-NKLG-JOB1/build/de.cau.cs.kieler.klayjs/test/js/src/test_wrapper.js:111:14: The global `expect` is removed in QUnit 2.0.
27-Jun-2016 05:04:47 >> Details in our upgrade guide at https://qunitjs.com/upgrade-guide-2.x/
27-Jun-2016 05:04:47 >> Actual: null
27-Jun-2016 05:04:47 >> Expected: undefined
27-Jun-2016 05:04:47 >> file:///var/atlassian/bamboo-data/xml-data/build-dir/KIPRAG-NKLG-JOB1/build/de.cau.cs.kieler.klayjs/test/js/node_modules/qunitjs/qunit/qunit.js:2144:4
27-Jun-2016 05:04:47
27-Jun-2016 05:04:47 >> [browser]InvalidLayoutTest
27-Jun-2016 05:04:47 >> Message: Died on test #1 testInBrowser@file:///var/atlassian/bamboo-data/xml-data/build-dir/KIPRAG-NKLG-JOB1/build/de.cau.cs.kieler.klayjs/test/js/src/test_wrapper.js:5:13
27-Jun-2016 05:04:47 >> file:///var/atlassian/bamboo-data/xml-data/build-dir/KIPRAG-NKLG-JOB1/build/de.cau.cs.kieler.klayjs/test/js/src/test_wrapper.js:117:20
27-Jun-2016 05:04:47 >> forEach@[native code]
27-Jun-2016 05:04:47 >> global code@file:///var/atlassian/bamboo-data/xml-data/build-dir/KIPRAG-NKLG-JOB1/build/de.cau.cs.kieler.klayjs/test/js/src/test_wrapper.js:111:14: The global `expect` is removed in QUnit 2.0.
27-Jun-2016 05:04:47 >> Details in our upgrade guide at https://qunitjs.com/upgrade-guide-2.x/
27-Jun-2016 05:04:47 >> Actual: null
27-Jun-2016 05:04:47 >> Expected: undefined
27-Jun-2016 05:04:47 >> file:///var/atlassian/bamboo-data/xml-data/build-dir/KIPRAG-NKLG-JOB1/build/de.cau.cs.kieler.klayjs/test/js/node_modules/qunitjs/qunit/qunit.js:2144:4
27-Jun-2016 05:04:47
27-Jun-2016 05:04:47 >> [browser]EdgeSpecificationTest
27-Jun-2016 05:04:47 >> Message: Died on test #1 testInBrowser@file:///var/atlassian/bamboo-data/xml-data/build-dir/KIPRAG-NKLG-JOB1/build/de.cau.cs.kieler.klayjs/test/js/src/test_wrapper.js:5:13
27-Jun-2016 05:04:47 >> file:///var/atlassian/bamboo-data/xml-data/build-dir/KIPRAG-NKLG-JOB1/build/de.cau.cs.kieler.klayjs/test/js/src/test_wrapper.js:117:20
27-Jun-2016 05:04:47 >> forEach@[native code]
27-Jun-2016 05:04:47 >> global code@file:///var/atlassian/bamboo-data/xml-data/build-dir/KIPRAG-NKLG-JOB1/build/de.cau.cs.kieler.klayjs/test/js/src/test_wrapper.js:111:14: The global `expect` is removed in QUnit 2.0.
27-Jun-2016 05:04:47 >> Details in our upgrade guide at https://qunitjs.com/upgrade-guide-2.x/
27-Jun-2016 05:04:47 >> Actual: null
27-Jun-2016 05:04:47 >> Expected: undefined
27-Jun-2016 05:04:47 >> file:///var/atlassian/bamboo-data/xml-data/build-dir/KIPRAG-NKLG-JOB1/build/de.cau.cs.kieler.klayjs/test/js/node_modules/qunitjs/qunit/qunit.js:2144:4
27-Jun-2016 05:04:47
27-Jun-2016 05:04:48 Warning: 8/8 assertions failed (29ms) Use --force to continue.
27-Jun-2016 05:04:48
27-Jun-2016 05:04:48 Aborted due to warnings.
27-Jun-2016 05:04:48 :test/js:testBrowser FAILED
27-Jun-2016 05:04:48
27-Jun-2016 05:04:48 FAILURE: Build failed with an exception.
27-Jun-2016 05:04:48
27-Jun-2016 05:04:48 * What went wrong:
27-Jun-2016 05:04:48 Execution failed for task ':test/js:testBrowser'.
27-Jun-2016 05:04:48 > Process 'command 'node'' finished with non-zero exit value 6
27-Jun-2016 05:04:48
27-Jun-2016 05:04:48 * Try:
27-Jun-2016 05:04:48 Run with --stacktrace option to get the stack trace. Run with --info or --debug option to get more log output.
27-Jun-2016 05:04:48
27-Jun-2016 05:04:48 BUILD FAILED
27-Jun-2016 05:04:48
27-Jun-2016 05:04:48 Total time: 4 mins 39.555 secs
27-Jun-2016 05:04:49 Failing task since return code of [./gradlew -Dorg.gradle.java.home=/opt/java/jdk64_1.8 -Dorg.gradle.daemon=false -PtestReporter=JUnit clean getGWT all] was 1 while expected 0
27-Jun-2016 05:04:49 Finished task 'gradle' with result: Failed
27-Jun-2016 05:04:49 Running post build plugin 'npm Cache Cleanup'
27-Jun-2016 05:04:49 Running post build plugin 'NCover Results Collector'
27-Jun-2016 05:04:49 Running post build plugin 'Clover Results Collector'
27-Jun-2016 05:04:49 Running post build plugin 'Docker Container Cleanup'
27-Jun-2016 05:04:49 Running post build plugin 'Artifact Copier'
27-Jun-2016 05:04:49 Publishing an artifact: KIELER Layout (KLayGWT) Libraries
27-Jun-2016 05:04:49 Finished publishing of artifact Shared artifact: [KIELER Layout (KLayGWT) Libraries], pattern: [*.zip] anchored at: [build/de.cau.cs.kieler.klayjs/target/] in 0s
27-Jun-2016 05:04:49 Finalising the build...
27-Jun-2016 05:04:49 Stopping timer.
27-Jun-2016 05:04:49 Build KIPRAG-NKLG-JOB1-873 completed.
27-Jun-2016 05:04:49 Running on server: post build plugin 'NCover Results Collector'
27-Jun-2016 05:04:49 Running on server: post build plugin 'Clover Delta Calculator'
27-Jun-2016 05:04:49 Running on server: post build plugin 'Maven Dependencies Postprocessor'
27-Jun-2016 05:04:49 Running on server: post build plugin 'Build Hanging Detection Configuration'
27-Jun-2016 05:04:49 All post build plugins have finished
27-Jun-2016 05:04:49 Generating build results summary...
27-Jun-2016 05:04:49 Saving build results to disk...
27-Jun-2016 05:04:49 Logging substituted variables...
27-Jun-2016 05:04:49 Indexing build results...
27-Jun-2016 05:04:49 Finished building KIPRAG-NKLG-JOB1-873.