Continuously builds all semantics plug-ins upon repository changes.

Build result summary

Details

Completed
Duration
10 minutes
Labels
None
Revisions
KIELER Semantics
29fddcb48a6d6b8304db6d002fe1e76e8544bf4d 29fddcb48a6d6b8304db6d002fe1e76e8544bf4d
Models Repository
37695321b4948d6580dd5ffdefecc33be88fad50 37695321b4948d6580dd5ffdefecc33be88fad50
Total tests
681
Fixed in
#1583 (Manual run by cmot)

Tests

Responsible

  • cmot cmot Automatically assigned

Code commits

KIELER Semantics
Author Commit Message Commit date
Christian Motika <cmot@informatik.uni-kiel.de> Christian Motika <cmot@informatik.uni-kiel.de> 29fddcb48a6d6b8304db6d002fe1e76e8544bf4d 29fddcb48a6d6b8304db6d002fe1e76e8544bf4d Merge remote-tracking branch 'origin/cmot-diss' into integration/cmot-diss
Conflicts:
        plugins/de.cau.cs.kieler.kico.klighd/src/de/cau/cs/kieler/kico/klighd/KiCoModelUpdateController.java
        plugins/de.cau.cs.kieler.sccharts.sim.c/src/de/cau/cs/kieler/sccharts/sim/c/SCChartsCDataComponent.java
        plugins/de.cau.cs.kieler.sccharts.text/src/de/cau/cs/kieler/sccharts/text/sct/validation/SctJavaValidator.java
Christian Motika <cmot@informatik.uni-kiel.de> Christian Motika <cmot@informatik.uni-kiel.de> a766763ec3d82dc6522846dc1495f710a6e84b94 m a766763ec3d82dc6522846dc1495f710a6e84b94 xtext validator rules
Christian Motika <cmot@informatik.uni-kiel.de> Christian Motika <cmot@informatik.uni-kiel.de> f679c89fbe829a1828bf0d8433f4aba013a745ea m f679c89fbe829a1828bf0d8433f4aba013a745ea minor: error message
Christian Motika <cmot@informatik.uni-kiel.de> Christian Motika <cmot@informatik.uni-kiel.de> debfaf3ef2b850072b813f241dbcf8bdb7a2b575 m debfaf3ef2b850072b813f241dbcf8bdb7a2b575 Modified error message
Christian Motika <cmot@informatik.uni-kiel.de> Christian Motika <cmot@informatik.uni-kiel.de> 51d7cc5be1951053004c834f2bf2ac62ed7c812f m 51d7cc5be1951053004c834f2bf2ac62ed7c812f The source model contains error markers

Tests

New test failures 2
Status Test View job Duration
Collapse Failed SCChartsSimCAutomatedJUnitTest /test-sccharts-c/testdata-must-fail/not_asc_schedulable/testdata-cmot-diss/motivation-weakabort-transitionpriority.eso History
Compile and Package 1 sec
java.lang.AssertionError: A test that must fail finished successfully. Other tests may have no significance.
	at org.junit.Assert.fail(Assert.java:88)
	at de.cau.cs.kieler.sim.kiem.test.KiemAutomatedJUnitTest.kiemAutomatedJUnitTestExecution(KiemAutomatedJUnitTest.java:477)
	at sun.reflect.NativeMethodAccessorImpl.invoke0(Native Method)
	at sun.reflect.NativeMethodAccessorImpl.invoke(NativeMethodAccessorImpl.java:62)
	at sun.reflect.DelegatingMethodAccessorImpl.invoke(DelegatingMethodAccessorImpl.java:43)
	at java.lang.reflect.Method.invoke(Method.java:497)
	at org.junit.runners.model.FrameworkMethod$1.runReflectiveCall(FrameworkMethod.java:50)
(63 more lines...)
Collapse Failed SCChartsSimCAutomatedJUnitTest /test-sccharts-c/testdata-must-fail/not_asc_schedulable/testdata-cmot-diss/AbortComplexityWeakNotSchedulable.eso History
Compile and Package 1 sec
java.lang.AssertionError: A test that must fail finished successfully. Other tests may have no significance.
	at org.junit.Assert.fail(Assert.java:88)
	at de.cau.cs.kieler.sim.kiem.test.KiemAutomatedJUnitTest.kiemAutomatedJUnitTestExecution(KiemAutomatedJUnitTest.java:477)
	at sun.reflect.NativeMethodAccessorImpl.invoke0(Native Method)
	at sun.reflect.NativeMethodAccessorImpl.invoke(NativeMethodAccessorImpl.java:62)
	at sun.reflect.DelegatingMethodAccessorImpl.invoke(DelegatingMethodAccessorImpl.java:43)
	at java.lang.reflect.Method.invoke(Method.java:497)
	at org.junit.runners.model.FrameworkMethod$1.runReflectiveCall(FrameworkMethod.java:50)
(63 more lines...)