Continuously builds all semantics plug-ins upon repository changes.

Build: #22 failed Changes by 3 people

Logs

The following logs have been generated by the jobs in this plan.
  • Expand all
  • Collapse all
Job Logs
Collapse Compile and Package Build Download or View
04-Jun-2013 13:10:27         at sun.reflect.NativeMethodAccessorImpl.invoke(NativeMethodAccessorImpl.java:39)
04-Jun-2013 13:10:27         at sun.reflect.DelegatingMethodAccessorImpl.invoke(DelegatingMethodAccessorImpl.java:25)
04-Jun-2013 13:10:27         at java.lang.reflect.Method.invoke(Method.java:597)
04-Jun-2013 13:10:27         at org.codehaus.plexus.classworlds.launcher.Launcher.launchEnhanced(Launcher.java:290)
04-Jun-2013 13:10:27         at org.codehaus.plexus.classworlds.launcher.Launcher.launch(Launcher.java:230)
04-Jun-2013 13:10:27         at org.codehaus.plexus.classworlds.launcher.Launcher.mainWithExitCode(Launcher.java:409)
04-Jun-2013 13:10:27         at org.codehaus.plexus.classworlds.launcher.Launcher.main(Launcher.java:352)
04-Jun-2013 13:10:27 Caused by: java.lang.RuntimeException: "No solution found because the problem is unsatisfiable.": ["Unable to satisfy dependency from de.cau.cs.kieler.synccharts.sim.s 0.3.0.qualifier to bundle de.cau.cs.kieler.s.sim.sj 0.1.0.", "Unable to satisfy dependency from de.cau.cs.kieler.synccharts.sim.s 0.3.0.qualifier to bundle de.cau.cs.kieler.s.sj 0.1.0.", "Unable to satisfy dependency from de.cau.cs.kieler.synccharts.sim.s 0.3.0.qualifier to bundle de.cau.cs.kieler.sjl 1.0.0.", "Unable to satisfy dependency from org.eclipse.jdt.core 3.8.1.v_OTDT_r210_201206090452 to org.eclipse.objectteams.otdt.core.patch.feature.group [2.0.0,3.0.0).", "Unable to satisfy dependency from org.eclipse.jdt.core 3.8.2.v_OTDT_r211_201209011847 to org.eclipse.objectteams.otdt.core.patch.feature.group [2.0.0,3.0.0).", "Unable to satisfy dependency from org.eclipse.jdt.core 3.8.3.v_OTDT_r212_201301271217 to org.eclipse.objectteams.otdt.core.patch.feature.group [2.0.0,3.0.0).", "No solution found because the problem is unsatisfiable."]
04-Jun-2013 13:10:27         at org.eclipse.tycho.p2.impl.resolver.AbstractResolutionStrategy.newResolutionException(AbstractResolutionStrategy.java:79)
04-Jun-2013 13:10:27         at org.eclipse.tycho.p2.impl.resolver.ProjectorResolutionStrategy.resolve(ProjectorResolutionStrategy.java:83)
04-Jun-2013 13:10:27         at org.eclipse.tycho.p2.impl.resolver.P2ResolverImpl.resolveProject(P2ResolverImpl.java:118)
04-Jun-2013 13:10:27         at org.eclipse.tycho.p2.impl.resolver.P2ResolverImpl.resolveProject(P2ResolverImpl.java:76)
04-Jun-2013 13:10:27         at org.eclipse.tycho.p2.resolver.P2TargetPlatformResolver.doResolvePlatform(P2TargetPlatformResolver.java:448)
04-Jun-2013 13:10:27         at org.eclipse.tycho.p2.resolver.P2TargetPlatformResolver.resolveDependencies(P2TargetPlatformResolver.java:425)
04-Jun-2013 13:10:27         at org.eclipse.tycho.core.resolver.DefaultTychoDependencyResolver.resolveProject(DefaultTychoDependencyResolver.java:98)
04-Jun-2013 13:10:27         at org.eclipse.tycho.core.maven.TychoMavenLifecycleParticipant.afterProjectsRead(TychoMavenLifecycleParticipant.java:64)
04-Jun-2013 13:10:27         at org.apache.maven.DefaultMaven.doExecute(DefaultMaven.java:274)
04-Jun-2013 13:10:27         at org.apache.maven.DefaultMaven.execute(DefaultMaven.java:156)
04-Jun-2013 13:10:27         ... 11 more
04-Jun-2013 13:10:27 [ERROR]
04-Jun-2013 13:10:27 [ERROR] To see the full stack trace of the errors, re-run Maven with the -e switch.
04-Jun-2013 13:10:27 [ERROR] Re-run Maven using the -X switch to enable full debug logging.
04-Jun-2013 13:10:27 [ERROR]
04-Jun-2013 13:10:27 [ERROR] For more information about the errors and possible solutions, please read the following articles:
04-Jun-2013 13:10:27 [ERROR] [Help 1] http://cwiki.apache.org/confluence/display/MAVEN/InternalErrorException