Builds the KIELER Ptolemy Browser each night.

Build: #664 failed Scheduled

Logs

The following logs have been generated by the jobs in this plan.
  • Expand all
  • Collapse all
Job Logs
Collapse Checkout and Build Build Download or View
07-Feb-2021 06:01:53 [INFO] OpenKieler Ptolemy Browser Branding Plug-In ........ SKIPPED
07-Feb-2021 06:01:53 [INFO] OpenKieler Ptolemy Browser Product Feature ......... SKIPPED
07-Feb-2021 06:01:53 [INFO] OpenKieler Ptolemy Browser Repository .............. SKIPPED
07-Feb-2021 06:01:53 [INFO] OpenKieler Ptolemy Browser Product Build ........... SKIPPED
07-Feb-2021 06:01:53 [INFO] ------------------------------------------------------------------------
07-Feb-2021 06:01:53 [INFO] BUILD FAILURE
07-Feb-2021 06:01:53 [INFO] ------------------------------------------------------------------------
07-Feb-2021 06:01:53 [INFO] Total time: 01:48 min
07-Feb-2021 06:01:53 [INFO] Finished at: 2021-02-07T06:01:53+01:00
07-Feb-2021 06:01:54 [INFO] Final Memory: 169M/1077M
07-Feb-2021 06:01:54 [INFO] ------------------------------------------------------------------------
07-Feb-2021 06:01:54 [ERROR] Failed to execute goal org.eclipse.xtend:xtend-maven-plugin:2.16.0:compile (default) on project de.cau.cs.kieler.ptbrowser.klighd: Error compiling xtend sources in '/var/atlassian/bamboo/xml-data/build-dir/OPENKIELER-PTBROWSE-JOB1/ptbrowser/plugins/de.cau.cs.kieler.ptbrowser.klighd/src'. -> [Help 1]
07-Feb-2021 06:01:54 [ERROR]
07-Feb-2021 06:01:54 [ERROR] To see the full stack trace of the errors, re-run Maven with the -e switch.
07-Feb-2021 06:01:54 [ERROR] Re-run Maven using the -X switch to enable full debug logging.
07-Feb-2021 06:01:54 [ERROR]
07-Feb-2021 06:01:54 [ERROR] For more information about the errors and possible solutions, please read the following articles:
07-Feb-2021 06:01:54 [ERROR] [Help 1] http://cwiki.apache.org/confluence/display/MAVEN/MojoExecutionException
07-Feb-2021 06:01:54 [ERROR]
07-Feb-2021 06:01:54 [ERROR] After correcting the problems, you can resume the build with the command
07-Feb-2021 06:01:54 [ERROR]   mvn <goals> -rf :de.cau.cs.kieler.ptbrowser.klighd
07-Feb-2021 06:01:54 Unable to publish artifact [OpenKieler PtBrowser Repository]: the source directory /var/atlassian/bamboo/xml-data/build-dir/OPENKIELER-PTBROWSE-JOB1/ptbrowser/build/de.cau.cs.kieler.ptbrowser.repository/target/repository does not exist.
07-Feb-2021 06:01:54 The artifact is required for down stream Stages and Jobs, build will now fail.
07-Feb-2021 06:01:54 Unable to publish artifact [OpenKieler PtBrowser Products]: the source directory /var/atlassian/bamboo/xml-data/build-dir/OPENKIELER-PTBROWSE-JOB1/ptbrowser/build/de.cau.cs.kieler.ptbrowser.rcp.repository/target/products does not exist.
07-Feb-2021 06:01:54 The artifact is required for down stream Stages and Jobs, build will now fail.